[Samba] Error install samba 4

ducklinksys sergio.pato at gmail.com
Sat Oct 22 17:45:54 MDT 2011

When i try install samba 4 appear this error.

[ 686/3873] Compiling lib/util/charset/util_unistr_w.c
[ 687/3873] Compiling lib/util/charset/charcnv.c
In file included from ../libcli/smb/smb_common.h:31,
                 from ../lib/util/charset/charcnv.c:25:
../libcli/smb/smb_seal.h:24:27: error: gssapi/gssapi.h: No such file or
In file included from ../libcli/smb/smb_common.h:31,
                 from ../lib/util/charset/charcnv.c:25:
../libcli/smb/smb_seal.h:41: error: expected specifier-qualifier-list before
Waf: Leaving directory
Build failed:  -> task failed (err #1): 
	{task: cc charcnv.c -> charcnv_2.o}
make: *** [all] Error 1

Any suggestion please.

View this message in context: http://samba.2283325.n4.nabble.com/Error-install-samba-4-tp3929303p3929303.html
Sent from the Samba - General mailing list archive at Nabble.com.

More information about the samba mailing list