Build error on current git

Gémes Géza geza at
Tue Apr 24 07:12:19 MDT 2012


Today I've pulled the git repo (tried with a fresh clone as well), and
./configure.developer && make && make install fails with:

[ 934/3974] Compiling source4/auth/kerberos/krb5_init_context.c
In file included from ../source4/auth/kerberos/krb5_init_context.c:24:
../lib/replace/system/kerberos.h:43:27: error: gssapi/gssapi.h: No such
file or directory
../lib/replace/system/kerberos.h:51:32: error: gssapi/gssapi_krb5.h: No
such file or directory
Waf: Leaving directory `/usr/local/src/samba/bin'
Build failed:  -> task failed (err #1):
    {task: cc krb5_init_context.c -> krb5_init_context_1.o}
make: *** [all] Error 1

I suppose it has to do with the recent Heimdal, MIT krb5 related changes.



More information about the samba-technical mailing list