autobuild[sn-devel-184]: intermittent test failure detected

autobuild autobuild at
Fri May 17 04:09:38 UTC 2019

The autobuild test system (on sn-devel-184) has detected an intermittent failing test in 
the current master tree.

The autobuild log of the failure is available here:

The failure seems to be in the "samba-nt4" suite, whose build logs are available here:
The top commit at the time of the failure was:

commit ab648a4c63524038c9626a77be243c79c51975ac
Author: Volker Lendecke <vl at>
Date:   Thu May 16 15:38:26 2019 +0200

    smbd: Do oplock break messages in ndr
    The previous scheme was overloaded, a idl definition is easier to
    print, and it clarifies what data is actually needed
    Signed-off-by: Volker Lendecke <vl at>
    Reviewed-by: Jeremy Allison <jra at>
    Autobuild-User(master): Jeremy Allison <jra at>
    Autobuild-Date(master): Thu May 16 23:48:18 UTC 2019 on sn-devel-184

and the last 50 lines of the stdout log were:

[545(2507)/589 at 27m32s]$DOMAIN(nt4_dc:local)
[546(2508)/589 at 27m32s] samba.wbinfo_simple.check-secret.domain=$DOMAIN(nt4_dc:local)
[547(2509)/589 at 27m32s] samba.wbinfo_simple.change-secret.domain=$DOMAIN(nt4_dc:local)
[548(2510)/589 at 27m32s] samba.wbinfo_simple.check-secret.domain=$DOMAIN(nt4_dc:local)
[549(2511)/589 at 27m32s]$DOMAIN(nt4_dc:local)
[550(2512)/589 at 27m33s] samba.wbinfo_simple.domain-users(nt4_dc:local)
[551(2513)/589 at 27m33s] samba.wbinfo_simple.domain-groups(nt4_dc:local)
[552(2514)/589 at 27m33s]$DC_USERNAME(nt4_dc:local)
[553(2515)/589 at 27m33s]$DOMAIN/$DC_USERNAME(nt4_dc:local)
[554(2516)/589 at 27m33s] samba.wbinfo_simple.user-info=$DOMAIN/$DC_USERNAME(nt4_dc:local)
[555(2517)/589 at 27m33s] samba.wbinfo_simple.user-groups=$DOMAIN/$DC_USERNAME(nt4_dc:local)
[556(2518)/589 at 27m33s] samba.wbinfo_simple.authenticate=$DOMAIN/$DC_USERNAME%$DC_PASSWORD(nt4_dc:local)
[557(2519)/589 at 27m34s] samba.wbinfo_simple.allocate-uid(nt4_dc:local)
[558(2520)/589 at 27m34s] samba.wbinfo_simple.allocate-gid(nt4_dc:local)
[559(2521)/589 at 27m34s] samba.wbinfo_sids2xids.(nt4_dc:local)(nt4_dc:local)
[560(2522)/589 at 27m42s] samba.tests.ntlm_auth(nt4_dc:local)
[561(2535)/589 at 27m45s]
[562(2536)/589 at 27m45s] samba.wbinfo_simple.separator(nt4_member:local)
[563(2537)/589 at 27m45s] samba.wbinfo_simple.own-domain(nt4_member:local)
[564(2538)/589 at 27m45s] samba.wbinfo_simple.all-domains(nt4_member:local)
[565(2539)/589 at 27m45s] samba.wbinfo_simple.trusted-domains(nt4_member:local)
[566(2540)/589 at 27m45s] samba.wbinfo_simple.domain-info=BUILTIN(nt4_member:local)
[567(2541)/589 at 27m45s] samba.wbinfo_simple.domain-info=$DOMAIN(nt4_member:local)
[568(2542)/589 at 27m46s]
[569(2543)/589 at 27m46s]
[570(2544)/589 at 27m46s]$DOMAIN(nt4_member:local)
[571(2545)/589 at 27m46s] samba.wbinfo_simple.check-secret.domain=$DOMAIN(nt4_member:local)
UNEXPECTED(failure): samba.wbinfo_simple.check-secret.domain=SAMBA-TEST.wbinfo(nt4_member:local)
REASON: Exception: Exception: wbcCheckTrustCredentials(SAMBA-TEST): error code was NT_STATUS_DOMAIN_CONTROLLER_NOT_FOUND (0xc0000233)
failed to call wbcCheckTrustCredentials: WBC_ERR_AUTH_ERROR
Could not check secret
checking the trust secret for domain SAMBA-TEST via RPC calls failed

FAILED (1 failures, 0 errors and 0 unexpected successes in 0 testsuites)

A summary with detailed information can be found in:
TOP 10 slowest tests -> 159
samba3.raw.notify(nt4_dc) -> 104
samba3.smb2.oplock(nt4_dc) -> 102
samba3.smb2.notify(nt4_dc) -> 84
samba3.rpc.samr.passwords.lockout(nt4_dc) -> 61
samba4.rpc.echo on ncacn_np with object(nt4_dc) -> 61 -> 52
samba3.rpc.samr.passwords.pwdlastset(nt4_dc) -> 49
samba3.smb2.compound_find(nt4_dc) -> 48
samba3.raw.oplock(nt4_dc) -> 44
ERROR: test failed with exit code 1
Makefile:16: recipe for target 'test' failed

More information about the samba-cvs mailing list