autobuild[sn-devel-184]: intermittent test failure detected

autobuild autobuild at
Thu May 16 10:19:38 UTC 2019

The autobuild test system (on sn-devel-184) has detected an intermittent failing test in 
the current master tree.

The autobuild log of the failure is available here:

The failure seems to be in the "samba-nt4" suite, whose build logs are available here:
The top commit at the time of the failure was:

commit 82a40271719b5e3b12d13d50312dc793add647b1
Author: Volker Lendecke <vl at>
Date:   Wed May 15 18:23:27 2019 +0200

    smbd: Slightly simplify delay_for_oplock()
    We don't have to look at the leases.tdb record if it's our own lease.
    Signed-off-by: Volker Lendecke <vl at>
    Reviewed-by: Andreas Schneider <asn at>
    Autobuild-User(master): Andreas Schneider <asn at>
    Autobuild-Date(master): Thu May 16 07:59:52 UTC 2019 on sn-devel-184

and the last 50 lines of the stdout log were:

[157(857)/589 at 16m23s] samba3.base.rename(nt4_dc)
[158(858)/589 at 16m23s] samba3.base.rw1(nt4_dc)
[159(859)/589 at 16m24s] samba3.base.rw1(nt4_dc)
[160(860)/589 at 16m24s] samba3.base.rw1(nt4_dc)
[161(861)/589 at 16m24s] samba3.base.secleak(nt4_dc)
[162(862)/589 at 16m25s] samba3.base.tcon(nt4_dc)
[163(863)/589 at 16m25s] samba3.base.tcondev(nt4_dc)
[164(864)/589 at 16m25s] samba3.base.trans2(nt4_dc)
[165(865)/589 at 16m29s] samba3.base.unlink(nt4_dc)
[166(866)/589 at 16m29s] samba3.base.vuid(nt4_dc)
[167(867)/589 at 16m29s] samba3.base.xcopy(nt4_dc)
[168(868)/589 at 16m30s] samba3.base.samba3error(nt4_dc)
[169(869)/589 at 16m30s] samba3.raw.acls(nt4_dc)
[170(881)/589 at 16m33s] samba3.raw.acls nfs4acl_xattr-simple-40(nt4_dc)
[171(893)/589 at 16m35s] samba3.raw.acls nfs4acl_xattr-special-40(nt4_dc)
[172(905)/589 at 16m38s] samba3.raw.acls nfs4acl_xattr-simple-41(nt4_dc)
[173(917)/589 at 16m39s] samba3.raw.acls nfs4acl_xattr-xdr-40(nt4_dc)
[174(929)/589 at 16m42s] samba3.raw.acls nfs4acl_xattr-xdr-41(nt4_dc)
[175(941)/589 at 16m44s] samba3.raw.acls nfs4acl_xattr-nfs-40(nt4_dc)
[176(953)/589 at 16m46s] samba3.raw.acls nfs4acl_xattr-nfs-41(nt4_dc)
[177(965)/589 at 16m47s] samba3.raw.chkpath(nt4_dc)
[178(966)/589 at 16m48s] samba3.raw.close(nt4_dc)
[179(967)/589 at 16m48s] samba3.raw.composite(nt4_dc)
[180(971)/589 at 16m50s] samba3.raw.eas(nt4_dc)
[181(972)/589 at 16m50s] samba3.raw.lock(nt4_dc)
[182(985)/589 at 17m23s] samba3.raw.mkdir(nt4_dc)
[183(986)/589 at 17m24s] samba3.raw.mux(nt4_dc)
[184(987)/589 at 17m26s] samba3.raw.notify(nt4_dc)
Testing mkdir
UNEXPECTED(failure): samba3.raw.notify.mask(nt4_dc)
REASON: Exception: Exception: ../../source4/torture/raw/notify.c:835: notify.nttrans.out.changes[0].action was 2 (0x2), expected 1 (0x1): nchanges=1 action=2 expectedAction=1 filter=0x00000004

FAILED (1 failures, 0 errors and 0 unexpected successes in 0 testsuites)

A summary with detailed information can be found in:
TOP 10 slowest tests -> 78 -> 59
samba3.base.dir2(nt4_dc) -> 39
samba3.raw.lock(nt4_dc) -> 34
samba3.blackbox.smbclient_s3.SMB3.plain (nt4_dc)(nt4_dc) -> 34
samba3.blackbox.smbclient_s3.NT1.plain (nt4_member) member creds(nt4_member) -> 34
samba3.blackbox.smbclient_s3.NT1.plain (nt4_dc)(nt4_dc) -> 33
samba3.blackbox.smbclient_s3.SMB3.sign (nt4_member) member creds(nt4_member) -> 33
samba3.blackbox.smbclient_s3.SMB3.plain (nt4_member) member creds(nt4_member) -> 33
samba3.blackbox.smbclient_s3.SMB3.sign (nt4_dc)(nt4_dc) -> 33
ERROR: test failed with exit code 1
Makefile:16: recipe for target 'test' failed

More information about the samba-cvs mailing list