autobuild[sn-devel-184]: intermittent test failure detected

autobuild autobuild at
Tue May 7 22:09:09 UTC 2019

The autobuild test system (on sn-devel-184) has detected an intermittent failing test in 
the current master tree.

The autobuild log of the failure is available here:

The failure seems to be in the "samba-ad-dc-5" suite, whose build logs are available here:
The top commit at the time of the failure was:

commit bead4fdb88c9684a6c0ed066194cecb5d186026d
Author: Andreas Schneider <asn at>
Date:   Thu Feb 14 12:08:37 2019 +0100

    wafsamba: Enable warnings about zero-length formats
    Signed-off-by: Andreas Schneider <asn at>
    Reviewed-by: Ralph Boehme <slow at>
    Autobuild-User(master): Andreas Schneider <asn at>
    Autobuild-Date(master): Tue May  7 18:45:06 UTC 2019 on sn-devel-184

and the last 50 lines of the stdout log were:

[63(261)/322 at 19m19s] samba4.rpc.dssetup on ncalrpc with validate(ad_dc_default:local)
[64(262)/322 at 19m20s] samba4.rpc.altercontext on ncalrpc with validate(ad_dc_default:local)
smbtorture 4.11.0pre1-DEVELOPERBUILD
WARNING: The "lsa over netlogon" option is deprecated
WARNING: The "server schannel" option is deprecated
Using seed 1557266919
opening LSA connection
Testing change of primary context

Testing OpenPolicy2
Testing change of primary context
Opening secondary DSSETUP context
Testing change of primary context
Opening bad secondary connection
Testing DSSETUP pipe operations
dcerpc_dssetup_DsRoleGetPrimaryDomainInformation level 1
dcerpc_dssetup_DsRoleGetPrimaryDomainInformation level 2
dcerpc_dssetup_DsRoleGetPrimaryDomainInformation level 3

Testing Close

Testing change of primary context

Testing OpenPolicy2

Testing Close

Testing change of primary context

Testing OpenPolicy2
UNEXPECTED(failure): samba4.rpc.altercontext on ncalrpc with validate.altercontext(ad_dc_default:local)
REASON: Exception: Exception: ../../source4/torture/rpc/lsa.c:188: status was NT_STATUS_CONNECTION_RESET, expected NT_STATUS_CONNECTION_DISCONNECTED: OpenPolicy2 failed

FAILED (1 failures, 0 errors and 0 unexpected successes in 0 testsuites)

A summary with detailed information can be found in:
TOP 10 slowest tests
samba4.ldb.ldap with options '-U"$USERNAME%$PASSWORD"  --option=clientldapsaslwrapping=plain'(ad_dc_default)(ad_dc_default) -> 84
samba4.ldb.ldap with options '-U"$USERNAME%$PASSWORD" -k yes --option=clientldapsaslwrapping=plain'(ad_dc_default)(ad_dc_default) -> 81
samba4.rpc.schannel on ncacn_ip_tcp with seal,padcheck(ad_dc_default) -> 72
samba4.rpc.schannel on ncacn_np with seal,padcheck(ad_dc_default) -> 70
samba4.rpc.schannel on ncalrpc with seal,padcheck(ad_dc_default:local) -> 62
samba4.ldb.ldap with options '-U"$USERNAME%$PASSWORD" -k yes --encrypt'(ad_dc_default)(ad_dc_default) -> 59
samba4.rpc.schannel on ncalrpc with validate(ad_dc_default:local) -> 59
samba4.ldb.ldap with options '-U"$USERNAME%$PASSWORD"  --sign'(ad_dc_default)(ad_dc_default) -> 56
samba4.ldb.ldap with options '-U"$USERNAME%$PASSWORD" -k yes --sign'(ad_dc_default)(ad_dc_default) -> 55
samba4.ldb.ldap with options '-U"$USERNAME%$PASSWORD"  --encrypt'(ad_dc_default)(ad_dc_default) -> 53
ERROR: test failed with exit code 1
Makefile:16: recipe for target 'test' failed

More information about the samba-cvs mailing list