autobuild[sn-devel-184]: intermittent test failure detected

autobuild autobuild at samba.org
Sun Mar 3 22:05:26 UTC 2019


The autobuild test system (on sn-devel-184) has detected an intermittent failing test in 
the current master tree.

The autobuild log of the failure is available here:

   https://git.samba.org/autobuild.flakey.sn-devel-184/2019-03-03-2205/flakey.log

The failure seems to be in the "samba-nt4" suite, whose build logs are available here:

   https://git.samba.org/autobuild.flakey.sn-devel-184/2019-03-03-2205/samba-nt4.stderr
   https://git.samba.org/autobuild.flakey.sn-devel-184/2019-03-03-2205/samba-nt4.stdout
  
The top commit at the time of the failure was:

commit d1c2fe89073bf463a5791d433f60bc9381bdad62
Author: Volker Lendecke <vl at samba.org>
Date:   Thu Feb 28 21:47:51 2019 +0100

    libsmb: Make cli_posix_unlink/rmdir proper tevent_req/subreq pairs
    
    Signed-off-by: Volker Lendecke <vl at samba.org>
    Reviewed-by: Jeremy Allison <jra at samba.org>
    
    Autobuild-User(master): Jeremy Allison <jra at samba.org>
    Autobuild-Date(master): Sat Mar  2 00:55:56 UTC 2019 on sn-devel-144

and the last 50 lines of the stdout log were:

[542(2475)/586 at 23m38s] samba.wbinfo_simple.online-status.domain=$DOMAIN(nt4_dc:local)
[543(2476)/586 at 23m38s] samba.wbinfo_simple.check-secret.domain=$DOMAIN(nt4_dc:local)
[544(2477)/586 at 23m38s] samba.wbinfo_simple.change-secret.domain=$DOMAIN(nt4_dc:local)
[545(2478)/586 at 23m38s] samba.wbinfo_simple.check-secret.domain=$DOMAIN(nt4_dc:local)
[546(2479)/586 at 23m38s] samba.wbinfo_simple.online-status.domain=$DOMAIN(nt4_dc:local)
[547(2480)/586 at 23m38s] samba.wbinfo_simple.domain-users(nt4_dc:local)
[548(2481)/586 at 23m39s] samba.wbinfo_simple.domain-groups(nt4_dc:local)
[549(2482)/586 at 23m39s] samba.wbinfo_simple.name-to-sid=$DC_USERNAME(nt4_dc:local)
[550(2483)/586 at 23m39s] samba.wbinfo_simple.name-to-sid=$DOMAIN/$DC_USERNAME(nt4_dc:local)
[551(2484)/586 at 23m39s] samba.wbinfo_simple.user-info=$DOMAIN/$DC_USERNAME(nt4_dc:local)
[552(2485)/586 at 23m39s] samba.wbinfo_simple.user-groups=$DOMAIN/$DC_USERNAME(nt4_dc:local)
[553(2486)/586 at 23m39s] samba.wbinfo_simple.authenticate=$DOMAIN/$DC_USERNAME%$DC_PASSWORD(nt4_dc:local)
[554(2487)/586 at 23m39s] samba.wbinfo_simple.allocate-uid(nt4_dc:local)
[555(2488)/586 at 23m40s] samba.wbinfo_simple.allocate-gid(nt4_dc:local)
[556(2489)/586 at 23m40s] samba.wbinfo_sids2xids.(nt4_dc:local)(nt4_dc:local)
[557(2490)/586 at 23m48s] samba.tests.ntlm_auth(nt4_dc:local)
[558(2503)/586 at 23m50s] samba.wbinfo_simple.ping(nt4_member:local)
[559(2504)/586 at 23m50s] samba.wbinfo_simple.separator(nt4_member:local)
[560(2505)/586 at 23m50s] samba.wbinfo_simple.own-domain(nt4_member:local)
[561(2506)/586 at 23m50s] samba.wbinfo_simple.all-domains(nt4_member:local)
[562(2507)/586 at 23m51s] samba.wbinfo_simple.trusted-domains(nt4_member:local)
[563(2508)/586 at 23m51s] samba.wbinfo_simple.domain-info=BUILTIN(nt4_member:local)
[564(2509)/586 at 23m51s] samba.wbinfo_simple.domain-info=$DOMAIN(nt4_member:local)
[565(2510)/586 at 23m51s] samba.wbinfo_simple.online-status(nt4_member:local)
[566(2511)/586 at 23m51s] samba.wbinfo_simple.online-status.domain=BUILTIN(nt4_member:local)
[567(2512)/586 at 23m51s] samba.wbinfo_simple.online-status.domain=$DOMAIN(nt4_member:local)
[568(2513)/586 at 23m51s] samba.wbinfo_simple.check-secret.domain=$DOMAIN(nt4_member:local)
UNEXPECTED(failure): samba.wbinfo_simple.check-secret.domain=SAMBA-TEST.wbinfo(nt4_member:local)
REASON: Exception: Exception: wbcCheckTrustCredentials(SAMBA-TEST): error code was NT_STATUS_DOMAIN_CONTROLLER_NOT_FOUND (0xc0000233)
failed to call wbcCheckTrustCredentials: WBC_ERR_AUTH_ERROR
Could not check secret
checking the trust secret for domain SAMBA-TEST via RPC calls failed

FAILED (1 failures, 0 errors and 0 unexpected successes in 0 testsuites)

A summary with detailed information can be found in:
  ./bin/ab/summary
TOP 10 slowest tests
samba3.raw.notify(nt4_dc) -> 102
samba3.smb2.notify(nt4_dc) -> 83
samba3.rpc.samr.passwords.lockout(nt4_dc) -> 61
samba4.rpc.echo on ncacn_np with object(nt4_dc) -> 60
samba3.smb2.compound_find(nt4_dc) -> 51
samba3.rpc.samr.passwords.pwdlastset(nt4_dc) -> 49
samba3.blackbox.net.rpc.conf(nt4_dc) -> 47
samba3.smb2.compound_find(nt4_dc) -> 46
samba3.smb2.lease(nt4_dc) -> 45
samba3.raw.oplock(nt4_dc) -> 43
ERROR: test failed with exit code 1
Makefile:16: recipe for target 'test' failed



More information about the samba-cvs mailing list