autobuild[sn-devel-184]: intermittent test failure detected

autobuild autobuild at samba.org
Thu Jun 13 15:44:56 UTC 2019


The autobuild test system (on sn-devel-184) has detected an intermittent failing test in 
the current master tree.

The autobuild log of the failure is available here:

   https://git.samba.org/autobuild.flakey.sn-devel-184/2019-06-13-1544/flakey.log

The failure seems to be in the "samba-ad-dc-2" suite, whose build logs are available here:

   https://git.samba.org/autobuild.flakey.sn-devel-184/2019-06-13-1544/samba-ad-dc-2.stderr
   https://git.samba.org/autobuild.flakey.sn-devel-184/2019-06-13-1544/samba-ad-dc-2.stdout
  
The top commit at the time of the failure was:

commit fef8ec20d0f591f2e531a649108ca83c5a4fd744
Author: Gary Lockyer <gary at catalyst.net.nz>
Date:   Thu Jun 13 08:49:16 2019 +1200

    lib ldb ldb_key_value: csbuild unused parm ldb_kv
    
    Fixes csbuild error.
    
    Error: COMPILER_WARNING:
    lib/ldb/ldb_key_value/ldb_kv_search.c: scope_hint: In
    function ‘search_func’ lib/ldb/ldb_key_value/ldb_kv_search.c:308:47:
    warning: unused parameter ‘ldb_kv’ [-Wunused-parameter]
    
    Signed-off-by: Gary Lockyer <gary at catalyst.net.nz>
    Reviewed-by: Andreas Schneider <asn at samba.org>
    
    Autobuild-User(master): Andreas Schneider <asn at cryptomilk.org>
    Autobuild-Date(master): Thu Jun 13 08:27:12 UTC 2019 on sn-devel-184

and the last 50 lines of the stdout log were:

[22(135)/67 at 1m38s] samba.wbinfo_simple.user-groups=$DOMAIN/$DC_USERNAME(rodc:local)
[23(136)/67 at 1m39s] samba.wbinfo_simple.authenticate=$DOMAIN/$DC_USERNAME%$DC_PASSWORD(rodc:local)
[24(137)/67 at 1m39s] samba.wbinfo_simple.allocate-uid(rodc:local)
[25(138)/67 at 1m39s] samba.wbinfo_simple.allocate-gid(rodc:local)
[26(139)/67 at 1m39s] samba.wbinfo_sids2xids.(rodc:local)(rodc:local)
[27(140)/67 at 1m52s] samba.tests.ntlm_auth(rodc:local)
[28(153)/67 at 1m58s] samba.tests.encrypted_secrets(vampire_dc:local)
[29(155)/67 at 1m59s] samba.tests.py_credentials(vampire_dc)
[30(163)/67 at 2m2s] samba4.ldap.large_ldap.gssapi.python(vampire_dc)(vampire_dc)
[31(166)/67 at 4m0s] samba4.ldap.rodc.python(rodc)(rodc)
[32(172)/67 at 4m2s] samba4.ldap.rodc_rwdc.python(rodc)(rodc:local)
[33(192)/67 at 12m19s] samba4.drs.replica_sync_rodc.python(rodc)(rodc:local)
[34(194)/67 at 12m26s] samba4.rpc.samr.large-dc.one(vampire_dc)
[35(197)/67 at 12m39s] samba4.rpc.samr.large-dc.two(vampire_dc)
[36(200)/67 at 12m53s] samba4.rpc.echo(rodc)
[37(210)/67 at 12m57s] samba4.rpc.echo(rodc:local)
[38(220)/67 at 13m1s] samba4.rpc.echo.testallowed(rodc:local)
[39(230)/67 at 13m5s] samba4.rpc.echo.testdenied(rodc:local)
[40(240)/67 at 13m8s] samba4.blackbox.smbclient(rodc:local)(rodc:local)
[41(242)/67 at 13m10s] samba.tests.samba_tool.rodc(rodc:local)
[42(251)/67 at 13m43s] samba.blackbox.rpcclient_samlogon(rodc:local)
[43(255)/67 at 13m44s] samba.blackbox.rpcclient_samlogon_testallowed(rodc:local)
[44(259)/67 at 13m45s] samba.blackbox.rpcclient_samlogon_testdenied(rodc:local)
[45(263)/67 at 13m46s] samba4.drs.ridalloc_exop.python(vampire_dc)(vampire_dc)
[46(274)/67 at 19m9s] samba4.drs.samba_tool_drs.python(vampire_dc)(vampire_dc:local)
UNEXPECTED(error): samba4.drs.samba_tool_drs.python(vampire_dc).samba_tool_drs.SambaToolDrsTests.test_samba_tool_kcc(vampire_dc:local)
REASON: Exception: Exception: Traceback (most recent call last):
  File "/memdisk/autobuild/fl/b3834795/samba-ad-dc-2/source4/torture/drs/python/samba_tool_drs.py", line 81, in test_samba_tool_kcc
    self.cmdline_creds))
  File "bin/python/samba/tests/__init__.py", line 448, in check_output
    raise BlackboxProcessError(retcode, line, stdoutdata, stderrdata)
samba.tests.BlackboxProcessError: Command 'python3 /memdisk/autobuild/fl/b3834795/samba-ad-dc-2/bin/samba-tool drs kcc localdc -USAMBADOMAIN/Administrator%locDCpass1'; shell True; exit status 255; stdout: 'b'''; stderr: 'b"ERROR(runtime): DsExecuteKCC failed - (3221356597, 'The operation cannot be performed.')\n"'

FAILED (0 failures, 1 errors and 0 unexpected successes in 0 testsuites)

A summary with detailed information can be found in:
  ./bin/ab/summary
TOP 10 slowest tests
samba4.ldap.rodc_rwdc.python(rodc)(rodc:local) -> 496
samba4.drs.ridalloc_exop.python(vampire_dc)(vampire_dc) -> 322
samba4.ldap.large_ldap.gssapi.python(vampire_dc)(vampire_dc) -> 119
samba.tests.samba_tool.rodc(rodc:local) -> 33
samba4.rpc.samr.large-dc.two(vampire_dc) -> 13
samba4.rpc.samr.large-dc.one(vampire_dc) -> 13
samba.wbinfo_sids2xids.(rodc:local)(rodc:local) -> 13
samba4.drs.replica_sync_rodc.python(rodc)(rodc:local) -> 8
samba4.rpc.echo(rodc) -> 5
samba.tests.ntlm_auth(rodc:local) -> 5
ERROR: test failed with exit code 1
Makefile:16: recipe for target 'test' failed



More information about the samba-cvs mailing list