autobuild[sn-devel-144]: intermittent test failure detected

autobuild autobuild at
Wed Feb 13 12:47:42 UTC 2019

The autobuild test system (on sn-devel-144) has detected an intermittent failing test in 
the current master tree.

The autobuild log of the failure is available here:

The failure seems to be in the "samba-fileserver" suite, whose build logs are available here:
The top commit at the time of the failure was:

commit 30d505e91bbf8e08d6f80314798e4e1a48ae43f9
Author: Andrew Bartlett <abartlet at>
Date:   Tue Feb 12 09:34:54 2019 +1300

    selftest: Only set clockskew to 5 seconds for MIT Kerberos
    This was added in ac5427c6eba09134411f76a5e6f7e2643fa74eed as part of the MIT KDC
    effort, but makes some tests much less reliable under high load.
    As the Heimdal build does not need this, only specify for the MIT build.
    Tested with an MIT AD DC build with:
     make test TESTS="samba3.raw.session samba3.smb2.session"
    Signed-off-by: Andrew Bartlett <abartlet at>
    Reviewed-by: Gary Lockyer <gary at>
    Autobuild-User(master): Andrew Bartlett <abartlet at>
    Autobuild-Date(master): Wed Feb 13 05:49:43 CET 2019 on sn-devel-144

and the last 50 lines of the stdout log were:

[69(216)/97 at 7m36s] samba3.blackbox.shadow_copy2 SMB3 (fileserver)(fileserver)
[70(299)/97 at 11m9s] samba3.blackbox.shadow_copy_torture(fileserver)
[71(300)/97 at 11m10s] samba3.blackbox.smbclient.forceuser_validusers (fileserver)(fileserver)
[72(301)/97 at 11m11s] samba3.blackbox.smbget (fileserver)(fileserver)
[73(311)/97 at 11m19s] samba3.blackbox.netshareenum (fileserver)(fileserver)
[74(315)/97 at 11m21s] samba3.blackbox.acl_xattr.NT1(fileserver)
[75(327)/97 at 11m37s] samba3.blackbox.acl_xattr.SMB3(fileserver)
[76(339)/97 at 11m49s] samba3.blackbox.smb2.not_casesensitive (fileserver)(fileserver)
[77(341)/97 at 11m50s] samba3.blackbox.inherit_owner.default.NT1(fileserver)
[78(360)/97 at 12m2s] samba3.blackbox.inherit_owner.default.SMB3(fileserver)
[79(379)/97 at 12m13s] samba3.blackbox.inherit_owner.full.NT1(fileserver)
[80(398)/97 at 12m24s] samba3.blackbox.inherit_owner.full.SMB3(fileserver)
[81(417)/97 at 12m35s] samba3.blackbox.inherit_owner.unix.NT1(fileserver)
[82(436)/97 at 12m46s] samba3.blackbox.inherit_owner.unix.SMB3(fileserver)
[83(455)/97 at 12m57s] samba3.blackbox.large_acl.NT1(fileserver)
[84(456)/97 at 12m58s] samba3.blackbox.large_acl.SMB3(fileserver)
[85(457)/97 at 13m0s] samba3.blackbox.give_owner(fileserver)
[86(468)/97 at 13m5s]
[87(471)/97 at 13m7s] samba3.blackbox.force_group_change(fileserver)
[88(472)/97 at 13m14s] samba3.blackbox.smbclient_tarmode.NT1(fileserver)
[89(474)/97 at 13m19s] samba3.blackbox.smbclient_tarmode.SMB3(fileserver)
[90(476)/97 at 13m22s] samba3.blackbox.smbclient_tar.NT1(fileserver)
[91(498)/97 at 13m37s] samba3.blackbox.smbclient_tar.SMB3(fileserver)
[92(520)/97 at 13m48s] samba3.blackbox.net_usershare(fileserver:local)
[93(526)/97 at 13m51s] samba3.base.delaywrite(fileserver)
[94(543)/97 at 15m37s] samba3.base.deny1(fileserver)
[95(544)/97 at 16m32s] samba3.base.deny2(fileserver)
[96(545)/97 at 17m31s] samba3.smb2.notify-inotify(fileserver)
smbtorture 4.11.0pre1-DEVELOPERBUILD
Using seed 1550061998
Testing change notify of a rename with inotify
UNEXPECTED(failure): samba3.smb2.notify-inotify.inotify-rename(fileserver)
REASON: Exception: Exception: ../../source4/torture/smb2/notify.c:2591: status was NT_STATUS_CANCELLED, expected NT_STATUS_OK: smb2_notify_recv failed

FAILED (1 failures, 0 errors and 0 unexpected successes in 0 testsuites)

A summary with detailed information can be found in:
TOP 10 slowest tests
samba3.blackbox.shadow_copy2 NT1 (fileserver)(fileserver) -> 222
samba3.blackbox.shadow_copy2 SMB3 (fileserver)(fileserver) -> 213
samba3.base.delaywrite(fileserver) -> 106
samba3.base.deny2(fileserver) -> 60
samba3.base.deny1(fileserver) -> 55
samba3.blackbox.dfree_quota (fileserver)(fileserver) -> 39
samba3.smbtorture_s3.plain.OPLOCK1(fileserver) -> 31
samba3.blackbox.preserve_case (fileserver)(fileserver) -> 20
samba3.blackbox.acl_xattr.NT1(fileserver) -> 17
samba3.blackbox.smbclient_tar.NT1(fileserver) -> 15
ERROR: test failed with exit code 1

More information about the samba-cvs mailing list