autobuild[sn-devel-144]: intermittent test failure detected

autobuild autobuild at samba.org
Tue Apr 2 16:53:26 UTC 2019


The autobuild test system (on sn-devel-144) has detected an intermittent failing test in 
the current master tree.

The autobuild log of the failure is available here:

   https://git.samba.org/autobuild.flakey.sn-devel-144/2019-04-02-1853/flakey.log

The failure seems to be in the "samba-ad-dc-ntvfs" suite, whose build logs are available here:

   https://git.samba.org/autobuild.flakey.sn-devel-144/2019-04-02-1853/samba-ad-dc-ntvfs.stderr
   https://git.samba.org/autobuild.flakey.sn-devel-144/2019-04-02-1853/samba-ad-dc-ntvfs.stdout
  
The top commit at the time of the failure was:

commit 92c726dc7a83834ee0e49d83e676b02f7687f5cd
Author: Kristj√°n Valur <kristjan at rvx.is>
Date:   Tue Mar 12 09:33:15 2019 +0000

    make some auth functions return an NTSTATUS like other similar functions for better diagnostics.
    
    Signed-off-by: Kristj√°n Valur <kristjan at rvx.is>
    Reviewed-by: Andreas Schneider <asn at samba.org>
    Reviewed-by: Andrew Bartlett <abartlet at samba.org>
    
    Autobuild-User(master): Andrew Bartlett <abartlet at samba.org>
    Autobuild-Date(master): Tue Apr  2 02:12:48 UTC 2019 on sn-devel-144

and the last 50 lines of the stdout log were:

[215(856)/252 at 24m30s] samba4.smb.signing on with -k yes --signing=on(ad_dc_ntvfs)
[216(857)/252 at 24m31s] samba4.smb.signing on with -k yes --signing=required(ad_dc_ntvfs)
[217(858)/252 at 24m32s] samba4.smb.signing on with -k yes --option=gensec:fake_gssapi_krb5=yes --option=gensec:gssapi_krb5=no --signing=on(ad_dc_ntvfs)
[218(859)/252 at 24m32s] samba4.smb.signing on with -k yes --option=gensec:fake_gssapi_krb5=yes --option=gensec:gssapi_krb5=no --signing=required(ad_dc_ntvfs)
[219(860)/252 at 24m33s] samba4.smb.signing --signing=yes anon(ad_dc_ntvfs)
[220(861)/252 at 24m34s] samba4.smb.signing --signing=required anon(ad_dc_ntvfs)
[221(862)/252 at 24m34s] samba.tests.complex_expressions(ad_dc_ntvfs)
[222(884)/252 at 24m43s] samba.tests.samba_tool.gpo(ad_dc_ntvfs:local)
[223(896)/252 at 25m43s] samba.tests.dcerpc.registry(ad_dc_ntvfs:local)
[224(899)/252 at 25m44s] samba.tests.dcerpc.dnsserver(ad_dc_ntvfs)
[225(916)/252 at 26m7s] samba.tests.auth_log(ad_dc_ntvfs:local)
[226(963)/252 at 26m52s] samba.tests.auth_log_pass_change(ad_dc_ntvfs)
[227(971)/252 at 27m2s] samba.tests.auth_log_ncalrpc(ad_dc_ntvfs:local)
[228(973)/252 at 27m3s] samba.tests.auth_log_samlogon(ad_dc_ntvfs:local)
[229(974)/252 at 27m5s] samba.tests.auth_log_netlogon(ad_dc_ntvfs:local)
[230(975)/252 at 27m6s] samba.tests.auth_log_netlogon_bad_creds(ad_dc_ntvfs:local)
[231(979)/252 at 27m9s] samba.tests.password_hash_fl2008(ad_dc_ntvfs:local)
[232(983)/252 at 27m12s] samba.tests.krb5_credentials(ad_dc_ntvfs)
[233(986)/252 at 27m15s] samba.tests.py_credentials(ad_dc_ntvfs)
[234(994)/252 at 27m21s] samba.tests.emulate.traffic(ad_dc_ntvfs)
[235(996)/252 at 27m21s] samba.tests.emulate.traffic_packet(ad_dc_ntvfs)
[236(1085)/252 at 29m14s] samba.tests.blackbox.traffic_replay(ad_dc_ntvfs)
[237(1090)/252 at 29m50s] samba.tests.blackbox.traffic_learner(ad_dc_ntvfs)
[238(1092)/252 at 29m52s] samba.tests.blackbox.traffic_summary(ad_dc_ntvfs)
[239(1092)/252 at 29m53s] samba.tests.blackbox.smbcontrol(ad_dc_ntvfs:local)
[240(1094)/252 at 29m56s] samba4.urgent_replication.python(ad_dc_ntvfs)(ad_dc_ntvfs:local)
[241(1102)/252 at 30m2s] samba4.ldap.match_rules.python(ad_dc_ntvfs)
[242(1136)/252 at 30m34s] samba4.ldap.notification.python(ad_dc_ntvfs)(ad_dc_ntvfs)
UNEXPECTED(failure): samba4.ldap.notification.python(ad_dc_ntvfs).__main__.LDAPNotificationTest.test_simple_search(ad_dc_ntvfs)
REASON: Exception: Exception: Traceback (most recent call last):
  File "/memdisk/autobuild/fl/b208310/samba-ad-dc-ntvfs/source4/dsdb/tests/python/notification.py", line 151, in test_simple_search
    self.assertIsNotNone(msg3)
AssertionError: unexpectedly None

FAILED (1 failures, 0 errors and 0 unexpected successes in 0 testsuites)

A summary with detailed information can be found in:
  ./bin/ab/summary
TOP 10 slowest tests
samba4.raw.notify(ad_dc_ntvfs) -> 114
samba.tests.emulate.traffic_packet(ad_dc_ntvfs) -> 113
samba4.nbt.winsreplication(ad_dc_ntvfs) -> 73
samba.tests.samba_tool.gpo(ad_dc_ntvfs:local) -> 60
samba4.ntvfs.cifs.krb5.base.deny2(ad_dc_ntvfs) -> 59
samba4.base.deny2(ad_dc_ntvfs) -> 59
samba4.ntvfs.cifs.krb5.base.deny1(ad_dc_ntvfs) -> 54
samba4.base.deny1(ad_dc_ntvfs) -> 53
samba4.raw.oplock(ad_dc_ntvfs) -> 52
samba4.ntvfs.cifs.krb5.base.delete(ad_dc_ntvfs) -> 47
ERROR: test failed with exit code 1



More information about the samba-cvs mailing list