autobuild[sn-devel-144]: intermittent test failure detected

autobuild autobuild at samba.org
Fri Sep 28 05:30:29 UTC 2018


The autobuild test system (on sn-devel-144) has detected an intermittent failing test in 
the current master tree.

The autobuild log of the failure is available here:

   https://git.samba.org/autobuild.flakey.sn-devel-144/2018-09-28-0730/flakey.log

The failure seems to be in the "samba-py3" suite, whose build logs are available here:

   https://git.samba.org/autobuild.flakey.sn-devel-144/2018-09-28-0730/samba-py3.stderr
   https://git.samba.org/autobuild.flakey.sn-devel-144/2018-09-28-0730/samba-py3.stdout
  
The top commit at the time of the failure was:

commit 9c0a9c697f2ebce25de693573c0124addd5755fd
Author: Noel Power <noel.power at suse.com>
Date:   Wed Sep 19 10:20:02 2018 +0200

    s4/web_server: fix panic from wrong type extracted from conn
    
    enabling
      server services = +web
    
    and we get a panic
    
    web_server.c:251: Type mismatch: name[struct web_server_data] expected[struct task_server]
    smb_panic_default: PANIC (pid 29137): ../source4/web_server/web_server.c:251: Type mismatch: name[struct web_server_data] expected[struct task_server]
    
    Signed-off-by: Noel Power <noel.power at suse.com>
    Reviewed-by: Andrew Bartlett <abartlet at samba.org>
    
    Autobuild-User(master): Andrew Bartlett <abartlet at samba.org>
    Autobuild-Date(master): Fri Sep 28 03:57:47 CEST 2018 on sn-devel-144

and the last 50 lines of the stdout log were:

[47(400)/75 at 21m24s] samba4.drs.repl_move.python(vampire_dc).python3(vampire_dc)
[48(421)/75 at 24m5s] samba4.drs.getnc_exop.python(vampire_dc).python3(vampire_dc)
[49(433)/75 at 24m22s] samba4.drs.getnc_unpriv.python(vampire_dc).python3(vampire_dc)
[50(437)/75 at 24m30s] samba4.drs.link_conflicts.python(vampire_dc).python3(vampire_dc)
[51(449)/75 at 29m10s] samba4.drs.samba_tool_drs.python(promoted_dc).python3(promoted_dc:local)
[52(463)/75 at 32m6s] samba4.drs.samba_tool_drs_showrepl.python(promoted_dc).python3(promoted_dc:local)
[53(467)/75 at 32m26s] samba4.drs.replica_sync.python(promoted_dc).python3(promoted_dc:local)
[54(483)/75 at 34m45s] samba4.drs.delete_object.python(promoted_dc).python3(promoted_dc)
[55(485)/75 at 34m59s] samba4.drs.fsmo.python(promoted_dc).python3(promoted_dc)
[56(490)/75 at 35m17s] samba4.drs.repl_move.python(promoted_dc).python3(promoted_dc)
[57(511)/75 at 39m4s] samba4.drs.getnc_exop.python(promoted_dc).python3(promoted_dc)
[58(523)/75 at 39m21s] samba4.drs.getnc_unpriv.python(promoted_dc).python3(promoted_dc)
[59(527)/75 at 39m31s] samba4.drs.link_conflicts.python(promoted_dc).python3(promoted_dc)
[60(539)/75 at 44m35s] samba4.drs.repl_schema.python(vampire_dc).python3(vampire_dc)
[61(548)/75 at 47m41s] samba4.drs.repl_schema.python(promoted_dc).python3(promoted_dc)
[62(557)/75 at 49m50s] samba4.drs.getncchanges.python(vampire_dc).python3(vampire_dc)
[63(569)/75 at 56m46s] samba4.drs.getncchanges.python(promoted_dc).python3(promoted_dc)
[64(581)/75 at 1h3m49s] samba4.drs.repl_rodc.python(ad_dc_ntvfs).python3(ad_dc_ntvfs)
[65(589)/75 at 1h5m9s] samba.tests.join.python(ad_dc_ntvfs).python3(ad_dc_ntvfs)
[66(591)/75 at 1h9m38s] samba4.drs.cracknames.python(ad_dc_ntvfs).python3(ad_dc_ntvfs)
[67(594)/75 at 1h9m45s] samba.tests.kcc.python3(vampire_dc)
UNEXPECTED(error): samba.tests.kcc.python3.samba.tests.kcc.KCCTests.test_verify(vampire_dc)
REASON: Exception: Exception: Traceback (most recent call last):
  File "bin/python/samba/tests/kcc/__init__.py", line 80, in test_verify
    attempt_live_connections=False)
  File "bin/python/samba/kcc/__init__.py", line 2659, in run
    ('connected',))
  File "bin/python/samba/kcc/__init__.py", line 2513, in plot_all_connections
    vertex_colors=vertex_colours)
  File "bin/python/samba/kcc/graph_utils.py", line 334, in verify_and_dot
    for p, e, doc in errors)))
samba.kcc.graph_utils.GraphError: The 'dsa_final CN=NTDS Settings,CN=LOCALVAMPIREDC,CN=Servers,CN=Default-First-Site-Name,CN=Sites,CN=Configuration,DC=samba,DC=example,DC=com' graph lacks the following properties:
connected: the graph is not connected, as the following vertices are unreachable:

FAILED (0 failures, 1 errors and 0 unexpected successes in 0 testsuites)

A summary with detailed information can be found in:
  ./bin/ab/summary
TOP 10 slowest tests
samba4.drs.getncchanges.python(promoted_dc).python3(promoted_dc) -> 423
samba4.drs.getncchanges.python(vampire_dc).python3(vampire_dc) -> 416
samba4.drs.link_conflicts.python(promoted_dc).python3(promoted_dc) -> 305
samba4.drs.link_conflicts.python(vampire_dc).python3(vampire_dc) -> 280
samba.tests.join.python(ad_dc_ntvfs).python3(ad_dc_ntvfs) -> 269
samba4.drs.ridalloc_exop.python(vampire_dc).python3(vampire_dc) -> 232
samba4.drs.repl_move.python(promoted_dc).python3(promoted_dc) -> 226
samba4.drs.samba_tool_drs.python(vampire_dc).python3(vampire_dc:local) -> 191
samba4.drs.repl_schema.python(vampire_dc).python3(vampire_dc) -> 186
samba4.drs.replica_sync.python(vampire_dc).python3(vampire_dc:local) -> 175
ERROR: test failed with exit code 1



More information about the samba-cvs mailing list