autobuild[sn-devel-144]: intermittent test failure detected

autobuild autobuild at
Sun Sep 23 10:34:53 UTC 2018

The autobuild test system (on sn-devel-144) has detected an intermittent failing test in 
the current master tree.

The autobuild log of the failure is available here:

The failure seems to be in the "samba-fileserver" suite, whose build logs are available here:
The top commit at the time of the failure was:

commit 6dc9f70bbb733519bcd57a69cc87133224a9d2fe
Author: Philipp Gesang <philipp.gesang at>
Date:   Mon Aug 20 14:50:39 2018 +0200

    tests/blackbox: add test for net ads JSON output
    Implement blackbox tests for
        $ net ads info --json
        $ net ads lookup --json
    that validate
        a) JSON wellformedness (by feeding it into the JSON library
           that ships with Python), and
        b) equality of the set of keys printed to that of the
           non-JSON version.
    Reviewed-by: Gary Lockyer <gary at>
    Signed-off-by: Philipp Gesang <philipp.gesang at>
    Reviewed-by: Andrew Bartlett <abartlet at>
    Autobuild-User(master): Andrew Bartlett <abartlet at>
    Autobuild-Date(master): Sat Sep 22 09:20:09 CEST 2018 on sn-devel-144

and the last 50 lines of the stdout log were:

[66(131)/94 at 2m8s] samba3.blackbox.valid_users (fileserver)(fileserver)
[67(132)/94 at 2m8s] samba3.blackbox.offline (fileserver)(fileserver)
[68(133)/94 at 2m9s] samba3.blackbox.shadow_copy2 NT1 (fileserver)(fileserver)
[69(216)/94 at 3m5s] samba3.blackbox.shadow_copy2 SMB3 (fileserver)(fileserver)
[70(299)/94 at 4m1s] samba3.blackbox.smbclient.forceuser_validusers (fileserver)(fileserver)
[71(300)/94 at 4m1s] samba3.blackbox.smbget (fileserver)(fileserver)
[72(308)/94 at 4m4s] samba3.blackbox.netshareenum (fileserver)(fileserver)
[73(312)/94 at 4m5s] samba3.blackbox.acl_xattr.NT1(fileserver)
[74(324)/94 at 4m9s] samba3.blackbox.acl_xattr.SMB3(fileserver)
[75(336)/94 at 4m12s] samba3.blackbox.smb2.not_casesensitive (fileserver)(fileserver)
[76(338)/94 at 4m12s] samba3.blackbox.inherit_owner.default.NT1(fileserver)
[77(357)/94 at 4m15s] samba3.blackbox.inherit_owner.default.SMB3(fileserver)
[78(376)/94 at 4m18s] samba3.blackbox.inherit_owner.full.NT1(fileserver)
[79(395)/94 at 4m20s] samba3.blackbox.inherit_owner.full.SMB3(fileserver)
[80(414)/94 at 4m23s] samba3.blackbox.inherit_owner.unix.NT1(fileserver)
[81(433)/94 at 4m26s] samba3.blackbox.inherit_owner.unix.SMB3(fileserver)
[82(452)/94 at 4m29s] samba3.blackbox.large_acl.NT1(fileserver)
[83(453)/94 at 4m29s] samba3.blackbox.large_acl.SMB3(fileserver)
[84(454)/94 at 4m29s] samba3.blackbox.give_owner(fileserver)
[85(465)/94 at 4m31s] samba3.blackbox.smbclient_tarmode.NT1(fileserver)
[86(467)/94 at 4m32s] samba3.blackbox.smbclient_tarmode.SMB3(fileserver)
[87(469)/94 at 4m32s] samba3.blackbox.smbclient_tar.NT1(fileserver)
[88(491)/94 at 4m36s] samba3.blackbox.smbclient_tar.SMB3(fileserver)
[89(513)/94 at 4m40s] samba3.blackbox.net_usershare(fileserver:local)
[90(519)/94 at 4m41s] samba3.base.delaywrite(fileserver)
[91(536)/94 at 6m23s] samba3.base.deny1(fileserver)
[92(537)/94 at 7m16s] samba3.base.deny2(fileserver)
[93(538)/94 at 8m14s] samba3.smb2.notify-inotify(fileserver)
smbtorture 4.10.0pre1-DEVELOPERBUILD
Using seed 1537698862
Testing change notify of a rename with inotify
UNEXPECTED(failure): samba3.smb2.notify-inotify.inotify-rename(fileserver)
REASON: Exception: Exception: ../source4/torture/smb2/notify.c:2511: status was NT_STATUS_CANCELLED, expected NT_STATUS_OK: smb2_notify_recv failed

FAILED (1 failures, 0 errors and 0 unexpected successes in 0 testsuites)

A summary with detailed information can be found in:
TOP 10 slowest tests
samba3.base.delaywrite(fileserver) -> 102
samba3.blackbox.shadow_copy2 NT1 (fileserver)(fileserver) -> 57
samba3.base.deny2(fileserver) -> 57
samba3.blackbox.shadow_copy2 SMB3 (fileserver)(fileserver) -> 56
samba3.base.deny1(fileserver) -> 53
samba3.smbtorture_s3.plain(fileserver).OPLOCK1(fileserver) -> 31
samba3.blackbox.dfree_quota (fileserver)(fileserver) -> 18
samba3.smbtorture_s3.plain(fileserver).LOCK1(fileserver) -> 13
samba3.smbtorture_s3.plain(fileserver).OPLOCK2(fileserver) -> 10
samba3.smbtorture_s3.plain(fileserver).IOCTL(fileserver) -> 6
ERROR: test failed with exit code 1

More information about the samba-cvs mailing list