autobuild[sn-devel-144]: intermittent test failure detected

autobuild autobuild at
Thu Oct 25 04:34:58 UTC 2018

The autobuild test system (on sn-devel-144) has detected an intermittent failing test in 
the current master tree.

The autobuild log of the failure is available here:

The failure seems to be in the "samba-nt4" suite, whose build logs are available here:
The top commit at the time of the failure was:

commit d3571415469ece5341a330c8987139d0f5749e52
Author: Noel Power <noel.power at>
Date:   Thu Oct 18 09:49:24 2018 +0100

    CI/Autobuild: Remove samba-none-env-py3 test
    We now run a purepython3 none-env test, later when the whole
    build is running under python3 we will resurrect this job
    but as (samba-none-env-py2) for python2
    Signed-off-by: Noel Power <noel.power at>
    Reviewed-by: Andrew Bartlett <abartlet at>
    Autobuild-User(master): Andrew Bartlett <abartlet at>
    Autobuild-Date(master): Tue Oct 23 09:10:22 CEST 2018 on sn-devel-144

and the last 50 lines of the stdout log were:

[146(831)/571 at 6m10s] samba3.base.openattr(nt4_dc)
[147(832)/571 at 6m10s]
[148(833)/571 at 6m10s] samba3.base.rename(nt4_dc)
[149(834)/571 at 6m10s] samba3.base.rw1(nt4_dc)
[150(835)/571 at 6m11s] samba3.base.rw1(nt4_dc)
[151(836)/571 at 6m11s] samba3.base.rw1(nt4_dc)
[152(837)/571 at 6m11s] samba3.base.secleak(nt4_dc)
[153(838)/571 at 6m12s] samba3.base.tcon(nt4_dc)
[154(839)/571 at 6m12s] samba3.base.tcondev(nt4_dc)
[155(840)/571 at 6m12s] samba3.base.trans2(nt4_dc)
[156(841)/571 at 6m16s] samba3.base.unlink(nt4_dc)
[157(842)/571 at 6m16s] samba3.base.vuid(nt4_dc)
[158(843)/571 at 6m16s] samba3.base.xcopy(nt4_dc)
[159(844)/571 at 6m16s] samba3.base.samba3error(nt4_dc)
[160(845)/571 at 6m16s] samba3.raw.acls(nt4_dc)
[161(857)/571 at 6m18s] samba3.raw.acls nfs4acl_xattr-simple-40(nt4_dc)
[162(869)/571 at 6m21s] samba3.raw.acls nfs4acl_xattr-special-40(nt4_dc)
[163(881)/571 at 6m23s] samba3.raw.acls nfs4acl_xattr-simple-41(nt4_dc)
[164(893)/571 at 6m24s] samba3.raw.acls nfs4acl_xattr-xdr-40(nt4_dc)
[165(905)/571 at 6m26s] samba3.raw.acls nfs4acl_xattr-xdr-41(nt4_dc)
[166(917)/571 at 6m28s] samba3.raw.chkpath(nt4_dc)
[167(918)/571 at 6m28s] samba3.raw.close(nt4_dc)
[168(919)/571 at 6m29s] samba3.raw.composite(nt4_dc)
[169(923)/571 at 6m30s] samba3.raw.eas(nt4_dc)
[170(924)/571 at 6m30s] samba3.raw.lock(nt4_dc)
[171(937)/571 at 7m3s] samba3.raw.mkdir(nt4_dc)
[172(938)/571 at 7m3s] samba3.raw.mux(nt4_dc)
[173(939)/571 at 7m6s] samba3.raw.notify(nt4_dc)
Testing mkdir
Testing create file
UNEXPECTED(failure): samba3.raw.notify.mask(nt4_dc)
REASON: Exception: Exception: ../source4/torture/raw/notify.c:846: notify.nttrans.out.changes[0].action was 2 (0x2), expected 1 (0x1): nchanges=1 action=2 expectedAction=1 filter=0x00000002

FAILED (1 failures, 0 errors and 0 unexpected successes in 0 testsuites)

A summary with detailed information can be found in:
TOP 10 slowest tests -> 38
samba3.base.dir2(nt4_dc) -> 34
samba3.raw.lock(nt4_dc) -> 33
samba3.smbtorture_s3.crypt_client(nt4_dc).OPLOCK1(nt4_dc) -> 30 -> 25
samba3.base.defer_open(nt4_dc) -> 16
samba3.base.lock(nt4_dc) -> 11
samba3.smbtorture_s3.crypt_client(nt4_dc).OPLOCK2(nt4_dc) -> 11
samba3.smbtorture_s3.crypt_client(nt4_dc).IOCTL(nt4_dc) -> 8
samba3.blackbox.smbclient_s3.SMB3.crypt (nt4_dc)(nt4_dc) -> 8
ERROR: test failed with exit code 1

More information about the samba-cvs mailing list