autobuild[sn-devel-144]: intermittent test failure detected

autobuild autobuild at
Wed Oct 17 04:54:26 UTC 2018

The autobuild test system (on sn-devel-144) has detected an intermittent failing test in 
the current master tree.

The autobuild log of the failure is available here:

The failure seems to be in the "samba-nt4" suite, whose build logs are available here:
The top commit at the time of the failure was:

commit 2557ae53edcdb723a400f12d54081ef0c13b7600
Author: Volker Lendecke <vl at>
Date:   Sat Oct 13 13:41:59 2018 +0200

    lib: Move the "expired" for gencache_parse calculation into gencache.c
    Make it more robust
    Signed-off-by: Volker Lendecke <vl at>
    Reviewed-by: Jeremy Allison <jra at>
    Autobuild-User(master): Jeremy Allison <jra at>
    Autobuild-Date(master): Tue Oct 16 21:20:19 CEST 2018 on sn-devel-144

and the last 50 lines of the stdout log were:

[182(1048)/571 at 16m43s] samba3.raw.sfileinfo.bug(nt4_dc)
[183(1048)/571 at 16m43s] samba3.raw.streams(nt4_dc)
[184(1061)/571 at 16m47s] samba3.raw.unlink(nt4_dc)
[185(1064)/571 at 16m48s] samba3.raw.write(nt4_dc)
[186(1068)/571 at 16m49s] samba3.raw.samba3hide(nt4_dc)
[187(1069)/571 at 16m50s] samba3.raw.samba3badpath(nt4_dc)
[188(1070)/571 at 16m50s] samba3.raw.sfileinfo.rename(nt4_dc)
[189(1071)/571 at 16m51s] samba3.raw.session plain(nt4_dc)
[190(1073)/571 at 16m51s] samba3.raw.session enc(nt4_dc)
[191(1075)/571 at 16m52s] samba3.raw.samba3caseinsensitive(nt4_dc)
[192(1076)/571 at 16m52s] samba3.raw.samba3posixtimedlock(nt4_dc)
[193(1077)/571 at 16m58s] samba3.raw.samba3rootdirfid(nt4_dc)
[194(1078)/571 at 16m58s] samba3.raw.sfileinfo.end-of-file(nt4_dc)
[195(1079)/571 at 16m59s] samba3.raw.samba3checkfsp(nt4_dc)
[196(1080)/571 at 16m59s] samba3.raw.samba3closeerr(nt4_dc)
[197(1081)/571 at 16m59s] samba3.raw.samba3oplocklogoff(nt4_dc)
[198(1082)/571 at 17m0s] samba3.raw.samba3badnameblob(nt4_dc)
[199(1083)/571 at 17m0s] samba3.smb2.getinfo(nt4_dc)
[200(1089)/571 at 17m1s] samba3.smb2.lock aio(nt4_dc)
[201(1110)/571 at 17m5s] samba3.smb2.lock(nt4_dc)
[202(1131)/571 at 17m10s]
[203(1135)/571 at 17m10s] samba3.smb2.create(nt4_dc)
[204(1148)/571 at 17m13s] samba3.smb2.acls(nt4_dc)
[205(1156)/571 at 17m16s] samba3.smb2.notify(nt4_dc)
Testing notify cancel
Testing notify mkdir
Testing notify rmdir
Testing notify mkdir - rmdir - mkdir - rmdir
Testing buffered notify on create of 10 files
Testing notify on unlink for the first file
UNEXPECTED(failure): samba3.smb2.notify.dir(nt4_dc)
REASON: Exception: Exception: (../source4/torture/smb2/notify.c:398) wrong value for notify.smb2.out.num_changes  0x9 should be 0xa

FAILED (1 failures, 0 errors and 0 unexpected successes in 0 testsuites)

A summary with detailed information can be found in:
TOP 10 slowest tests
samba3.raw.notify(nt4_dc) -> 111 -> 92 -> 75
samba3.base.dir2(nt4_dc) -> 61 -> 58
samba3.raw.oplock(nt4_dc) -> 49
samba3.raw.lock(nt4_dc) -> 34
samba3.smbtorture_s3.crypt_client(nt4_dc).OPLOCK1(nt4_dc) -> 30 -> 25
samba3.blackbox.smbclient_s3.SMB3.sign (nt4_member) member creds(nt4_member) -> 18
ERROR: test failed with exit code 1

More information about the samba-cvs mailing list