autobuild[sn-devel-144]: intermittent test failure detected

autobuild autobuild at
Wed Nov 21 18:07:48 UTC 2018

The autobuild test system (on sn-devel-144) has detected an intermittent failing test in 
the current master tree.

The autobuild log of the failure is available here:

The failure seems to be in the "samba-nt4" suite, whose build logs are available here:
The top commit at the time of the failure was:

commit 24b1aa9da2e53e0dba89811f6a8d14b810bd48a8
Author: Joe Guo <joeg at>
Date:   Wed Oct 24 16:35:50 2018 +1300

    logger: use color automatically for a tty
    Signed-off-by: Joe Guo <joeg at>
    Reviewed-by: Andrew Bartlett <abartlet at>
    Reviewed-by: Douglas Bagnall <douglas.bagnall at>
    Autobuild-User(master): Andrew Bartlett <abartlet at>
    Autobuild-Date(master): Wed Nov 21 10:46:20 CET 2018 on sn-devel-144

and the last 50 lines of the stdout log were:

[146(831)/576 at 14m42s]
[147(832)/576 at 14m43s] samba3.base.openattr(nt4_dc)
[148(833)/576 at 14m44s]
[149(834)/576 at 14m44s] samba3.base.rename(nt4_dc)
[150(835)/576 at 14m44s] samba3.base.rw1(nt4_dc)
[151(836)/576 at 14m45s] samba3.base.rw1(nt4_dc)
[152(837)/576 at 14m46s] samba3.base.rw1(nt4_dc)
[153(838)/576 at 14m47s] samba3.base.secleak(nt4_dc)
[154(839)/576 at 14m48s] samba3.base.tcon(nt4_dc)
[155(840)/576 at 14m48s] samba3.base.tcondev(nt4_dc)
[156(841)/576 at 14m49s] samba3.base.trans2(nt4_dc)
[157(842)/576 at 14m52s] samba3.base.unlink(nt4_dc)
[158(843)/576 at 14m53s] samba3.base.vuid(nt4_dc)
[159(844)/576 at 14m53s] samba3.base.xcopy(nt4_dc)
[160(845)/576 at 14m54s] samba3.base.samba3error(nt4_dc)
[161(846)/576 at 14m54s] samba3.raw.acls(nt4_dc)
[162(858)/576 at 14m59s] samba3.raw.acls nfs4acl_xattr-simple-40(nt4_dc)
[163(870)/576 at 15m4s] samba3.raw.acls nfs4acl_xattr-special-40(nt4_dc)
[164(882)/576 at 15m7s] samba3.raw.acls nfs4acl_xattr-simple-41(nt4_dc)
[165(894)/576 at 15m9s] samba3.raw.acls nfs4acl_xattr-xdr-40(nt4_dc)
[166(906)/576 at 15m12s] samba3.raw.acls nfs4acl_xattr-xdr-41(nt4_dc)
[167(918)/576 at 15m14s] samba3.raw.chkpath(nt4_dc)
[168(919)/576 at 15m15s] samba3.raw.close(nt4_dc)
[169(920)/576 at 15m15s] samba3.raw.composite(nt4_dc)
[170(924)/576 at 15m17s] samba3.raw.eas(nt4_dc)
[171(925)/576 at 15m18s] samba3.raw.lock(nt4_dc)
[172(938)/576 at 15m52s] samba3.raw.mkdir(nt4_dc)
[173(939)/576 at 15m52s] samba3.raw.mux(nt4_dc)
[174(940)/576 at 15m55s] samba3.raw.notify(nt4_dc)
Testing mkdir
UNEXPECTED(failure): samba3.raw.notify.mask(nt4_dc)
REASON: Exception: Exception: ../../source4/torture/raw/notify.c:835: notify.nttrans.out.changes[0].action was 2 (0x2), expected 1 (0x1): nchanges=1 action=2 expectedAction=1 filter=0x00000004

FAILED (1 failures, 0 errors and 0 unexpected successes in 0 testsuites)

A summary with detailed information can be found in:
TOP 10 slowest tests -> 101 -> 68
samba3.base.dir2(nt4_dc) -> 54
samba3.raw.lock(nt4_dc) -> 34
samba3.blackbox.smbclient_s3.SMB3.crypt (nt4_dc)(nt4_dc) -> 32
samba3.blackbox.smbclient_s3.NT1.plain (nt4_member) member creds(nt4_member) -> 32
samba3.blackbox.smbclient_s3.SMB3.plain (nt4_member) member creds(nt4_member) -> 31
samba3.smbtorture_s3.crypt_client.OPLOCK1(nt4_dc) -> 30
samba3.blackbox.smbclient_s3.NT1.plain (nt4_dc)(nt4_dc) -> 28
samba3.blackbox.smbclient_s3.SMB3.plain (nt4_dc)(nt4_dc) -> 25
ERROR: test failed with exit code 1

More information about the samba-cvs mailing list