autobuild[sn-devel-144]: intermittent test failure detected

autobuild autobuild at
Thu Nov 8 18:03:51 UTC 2018

The autobuild test system (on sn-devel-144) has detected an intermittent failing test in 
the current master tree.

The autobuild log of the failure is available here:

The failure seems to be in the "samba-nt4" suite, whose build logs are available here:
The top commit at the time of the failure was:

commit 2d512b278e5905964c1294c587ba405678c3d10c
Author: Andreas Schneider <asn at>
Date:   Wed Nov 7 14:14:05 2018 +0100

    debug: Use debuglevel_(get|set) function
    Signed-off-by: Andreas Schneider <asn at>
    Reviewed-by: Jeremy Allison <jra at>
    Autobuild-User(master): Andreas Schneider <asn at>
    Autobuild-Date(master): Thu Nov  8 11:03:11 CET 2018 on sn-devel-144

and the last 50 lines of the stdout log were:

[184(1049)/576 at 16m1s] samba3.raw.streams(nt4_dc)
[185(1062)/576 at 16m5s] samba3.raw.unlink(nt4_dc)
[186(1065)/576 at 16m6s] samba3.raw.write(nt4_dc)
[187(1069)/576 at 16m7s] samba3.raw.samba3hide(nt4_dc)
[188(1070)/576 at 16m7s] samba3.raw.samba3badpath(nt4_dc)
[189(1071)/576 at 16m7s] samba3.raw.sfileinfo.rename(nt4_dc)
[190(1072)/576 at 16m8s] samba3.raw.session plain(nt4_dc)
[191(1074)/576 at 16m8s] samba3.raw.session enc(nt4_dc)
[192(1076)/576 at 16m9s] samba3.raw.samba3caseinsensitive(nt4_dc)
[193(1077)/576 at 16m9s] samba3.raw.samba3posixtimedlock(nt4_dc)
[194(1078)/576 at 16m15s] samba3.raw.samba3rootdirfid(nt4_dc)
[195(1079)/576 at 16m15s] samba3.raw.sfileinfo.end-of-file(nt4_dc)
[196(1080)/576 at 16m15s] samba3.raw.samba3checkfsp(nt4_dc)
[197(1081)/576 at 16m16s] samba3.raw.samba3closeerr(nt4_dc)
[198(1082)/576 at 16m16s] samba3.raw.samba3oplocklogoff(nt4_dc)
[199(1083)/576 at 16m16s] samba3.raw.samba3badnameblob(nt4_dc)
[200(1084)/576 at 16m17s] samba3.smb2.getinfo(nt4_dc)
[201(1090)/576 at 16m17s] samba3.smb2.lock aio(nt4_dc)
[202(1111)/576 at 16m22s] samba3.smb2.lock(nt4_dc)
[203(1132)/576 at 16m26s]
[204(1136)/576 at 16m26s] samba3.smb2.aio_delay(nt4_dc)
[205(1137)/576 at 16m30s] samba3.smb2.create(nt4_dc)
[206(1150)/576 at 16m32s] samba3.smb2.acls(nt4_dc)
[207(1158)/576 at 16m35s] samba3.smb2.notify(nt4_dc)
Testing notify cancel
Testing notify mkdir
Testing notify rmdir
Testing notify mkdir - rmdir - mkdir - rmdir
Testing buffered notify on create of 10 files
Testing notify on unlink for the first file
UNEXPECTED(failure): samba3.smb2.notify.dir(nt4_dc)
REASON: Exception: Exception: (../source4/torture/smb2/notify.c:398) wrong value for notify.smb2.out.num_changes  0x8 should be 0xa

FAILED (1 failures, 0 errors and 0 unexpected successes in 0 testsuites)

A summary with detailed information can be found in:
TOP 10 slowest tests
samba3.raw.notify(nt4_dc) -> 108 -> 67 -> 62
samba3.base.dir2(nt4_dc) -> 48
samba3.raw.oplock(nt4_dc) -> 47 -> 44
samba3.raw.lock(nt4_dc) -> 34
samba3.smbtorture_s3.crypt_client.OPLOCK1(nt4_dc) -> 30 -> 20
samba3.blackbox.smbclient_s3.SMB3.plain (nt4_dc)(nt4_dc) -> 18
ERROR: test failed with exit code 1

More information about the samba-cvs mailing list