autobuild[sn-devel-144]: intermittent test failure detected

autobuild autobuild at samba.org
Tue May 22 04:34:29 UTC 2018


The autobuild test system (on sn-devel-144) has detected an intermittent failing test in 
the current master tree.

The autobuild log of the failure is available here:

   https://git.samba.org/autobuild.flakey.sn-devel-144/2018-05-22-0634/flakey.log

The failure seems to be in the "samba-nt4" suite, whose build logs are available here:

   https://git.samba.org/autobuild.flakey.sn-devel-144/2018-05-22-0634/samba-nt4.stderr
   https://git.samba.org/autobuild.flakey.sn-devel-144/2018-05-22-0634/samba-nt4.stdout
  
The top commit at the time of the failure was:

commit 20fda4f600c46e73571709f718c78017b9b037a2
Author: Andrew Bartlett <abartlet at samba.org>
Date:   Mon May 21 13:58:12 2018 +1200

    auth: Use DBGC_AUTH as DBGC_CLASS for AD DC auth session code.
    
    Signed-off-by: Andrew Bartlett <abartlet at samba.org>
    Reviewed-by: Jeremy Allison <jra at samba.org>
    
    Autobuild-User(master): Jeremy Allison <jra at samba.org>
    Autobuild-Date(master): Tue May 22 02:42:32 CEST 2018 on sn-devel-144

and the last 50 lines of the stdout log were:

[454(2312)/501 at 17m37s] samba.wbinfo_simple.online-status.domain=$DOMAIN(nt4_dc:local)
[455(2313)/501 at 17m37s] samba.wbinfo_simple.check-secret.domain=$DOMAIN(nt4_dc:local)
[456(2314)/501 at 17m37s] samba.wbinfo_simple.change-secret.domain=$DOMAIN(nt4_dc:local)
[457(2315)/501 at 17m37s] samba.wbinfo_simple.check-secret.domain=$DOMAIN(nt4_dc:local)
[458(2316)/501 at 17m37s] samba.wbinfo_simple.online-status.domain=$DOMAIN(nt4_dc:local)
[459(2317)/501 at 17m37s] samba.wbinfo_simple.domain-users(nt4_dc:local)
[460(2318)/501 at 17m37s] samba.wbinfo_simple.domain-groups(nt4_dc:local)
[461(2319)/501 at 17m37s] samba.wbinfo_simple.name-to-sid=$DC_USERNAME(nt4_dc:local)
[462(2320)/501 at 17m38s] samba.wbinfo_simple.name-to-sid=$DOMAIN/$DC_USERNAME(nt4_dc:local)
[463(2321)/501 at 17m38s] samba.wbinfo_simple.user-info=$DOMAIN/$DC_USERNAME(nt4_dc:local)
[464(2322)/501 at 17m38s] samba.wbinfo_simple.user-groups=$DOMAIN/$DC_USERNAME(nt4_dc:local)
[465(2323)/501 at 17m38s] samba.wbinfo_simple.authenticate=$DOMAIN/$DC_USERNAME%$DC_PASSWORD(nt4_dc:local)
[466(2324)/501 at 17m38s] samba.wbinfo_simple.allocate-uid(nt4_dc:local)
[467(2325)/501 at 17m38s] samba.wbinfo_simple.allocate-gid(nt4_dc:local)
[468(2326)/501 at 17m38s] samba.wbinfo_sids2xids.(nt4_dc:local)(nt4_dc:local)
[469(2327)/501 at 17m44s] samba.ntlm_auth.diagnostics(nt4_dc:local)(nt4_dc:local)
[470(2328)/501 at 17m44s] samba.ntlm_auth.(nt4_dc:local)(nt4_dc:local)
[471(2347)/501 at 17m45s] samba.wbinfo_simple.ping(nt4_member:local)
[472(2348)/501 at 17m45s] samba.wbinfo_simple.separator(nt4_member:local)
[473(2349)/501 at 17m46s] samba.wbinfo_simple.own-domain(nt4_member:local)
[474(2350)/501 at 17m46s] samba.wbinfo_simple.all-domains(nt4_member:local)
[475(2351)/501 at 17m46s] samba.wbinfo_simple.trusted-domains(nt4_member:local)
[476(2352)/501 at 17m46s] samba.wbinfo_simple.domain-info=BUILTIN(nt4_member:local)
[477(2353)/501 at 17m46s] samba.wbinfo_simple.domain-info=$DOMAIN(nt4_member:local)
[478(2354)/501 at 17m46s] samba.wbinfo_simple.online-status(nt4_member:local)
[479(2355)/501 at 17m46s] samba.wbinfo_simple.online-status.domain=BUILTIN(nt4_member:local)
[480(2356)/501 at 17m46s] samba.wbinfo_simple.online-status.domain=$DOMAIN(nt4_member:local)
[481(2357)/501 at 17m46s] samba.wbinfo_simple.check-secret.domain=$DOMAIN(nt4_member:local)
UNEXPECTED(failure): samba.wbinfo_simple.check-secret.domain=SAMBA-TEST.wbinfo(nt4_member:local)
REASON: Exception: Exception: wbcCheckTrustCredentials(SAMBA-TEST): error code was NT_STATUS_DOMAIN_CONTROLLER_NOT_FOUND (0xc0000233)
failed to call wbcCheckTrustCredentials: WBC_ERR_AUTH_ERROR
Could not check secret
checking the trust secret for domain SAMBA-TEST via RPC calls failed

FAILED (1 failures, 0 errors and 0 unexpected successes in 0 testsuites)

A summary with detailed information can be found in:
  ./bin/ab/summary
TOP 10 slowest tests
samba3.raw.notify(nt4_dc) -> 97
samba3.smb2.notify(nt4_dc) -> 79
samba3.rpc.samr.passwords.lockout(nt4_dc) -> 61
samba4.rpc.echo on ncacn_np with object(nt4_dc) -> 60
samba3.rpc.samr.passwords.pwdlastset(nt4_dc) -> 49
samba3.smb2.lease(nt4_dc) -> 45
samba3.raw.oplock(nt4_dc) -> 41
samba3.smb2.oplock(nt4_dc) -> 41
samba3.raw.search(nt4_dc) -> 33
samba3.raw.lock(nt4_dc) -> 32
ERROR: test failed with exit code 1



More information about the samba-cvs mailing list