autobuild[sn-devel-144]: intermittent test failure detected

autobuild autobuild at
Thu Jun 28 10:32:38 UTC 2018

The autobuild test system (on sn-devel-144) has detected an intermittent failing test in 
the current master tree.

The autobuild log of the failure is available here:

The failure seems to be in the "samba-nt4" suite, whose build logs are available here:
The top commit at the time of the failure was:

commit 211275fae6895cdedbbe25ca3e41d0a856c1a370
Author: Douglas Bagnall <douglas.bagnall at>
Date:   Thu Jun 28 16:19:31 2018 +1200

    samba-tool showrepl tests: test all-good with --pull-summary
    We test the all-good case with --pull-summary, which is the only one
    we can be reasonably certain about.
    Signed-off-by: Douglas Bagnall <douglas.bagnall at>
    Reviewed-by: Andrew Bartlett <abartlet at>
    Autobuild-User(master): Douglas Bagnall <dbagnall at>
    Autobuild-Date(master): Thu Jun 28 09:23:10 CEST 2018 on sn-devel-144

and the last 50 lines of the stdout log were:

[179(1014)/502 at 11m26s] samba3.raw.sfileinfo.bug(nt4_dc)
[180(1014)/502 at 11m26s] samba3.raw.streams(nt4_dc)
[181(1027)/502 at 11m29s] samba3.raw.unlink(nt4_dc)
[182(1030)/502 at 11m30s] samba3.raw.write(nt4_dc)
[183(1034)/502 at 11m31s] samba3.raw.samba3hide(nt4_dc)
[184(1035)/502 at 11m31s] samba3.raw.samba3badpath(nt4_dc)
[185(1036)/502 at 11m31s] samba3.raw.sfileinfo.rename(nt4_dc)
[186(1037)/502 at 11m32s] samba3.raw.session plain(nt4_dc)
[187(1039)/502 at 11m32s] samba3.raw.session enc(nt4_dc)
[188(1041)/502 at 11m32s] samba3.raw.samba3caseinsensitive(nt4_dc)
[189(1042)/502 at 11m32s] samba3.raw.samba3posixtimedlock(nt4_dc)
[190(1043)/502 at 11m38s] samba3.raw.samba3rootdirfid(nt4_dc)
[191(1044)/502 at 11m38s] samba3.raw.sfileinfo.end-of-file(nt4_dc)
[192(1045)/502 at 11m38s] samba3.raw.samba3checkfsp(nt4_dc)
[193(1046)/502 at 11m39s] samba3.raw.samba3closeerr(nt4_dc)
[194(1047)/502 at 11m39s] samba3.raw.samba3oplocklogoff(nt4_dc)
[195(1048)/502 at 11m39s] samba3.raw.samba3badnameblob(nt4_dc)
[196(1049)/502 at 11m39s] samba3.smb2.getinfo(nt4_dc)
[197(1055)/502 at 11m40s] samba3.smb2.lock aio(nt4_dc)
[198(1076)/502 at 11m43s] samba3.smb2.lock(nt4_dc)
[199(1097)/502 at 11m46s]
[200(1101)/502 at 11m46s] samba3.smb2.create(nt4_dc)
[201(1114)/502 at 11m47s] samba3.smb2.acls(nt4_dc)
[202(1122)/502 at 11m49s] samba3.smb2.notify(nt4_dc)
Testing notify cancel
Testing notify mkdir
Testing notify rmdir
Testing notify mkdir - rmdir - mkdir - rmdir
Testing buffered notify on create of 10 files
Testing notify on unlink for the first file
UNEXPECTED(failure): samba3.smb2.notify.dir(nt4_dc)
REASON: Exception: Exception: (../source4/torture/smb2/notify.c:394) wrong value for notify.smb2.out.num_changes  0x9 should be 0xa

FAILED (1 failures, 0 errors and 0 unexpected successes in 0 testsuites)

A summary with detailed information can be found in:
TOP 10 slowest tests
samba3.raw.notify(nt4_dc) -> 101 -> 50
samba3.raw.oplock(nt4_dc) -> 44 -> 43
samba3.raw.lock(nt4_dc) -> 33 -> 33
samba3.smbtorture_s3.crypt_client(nt4_dc).OPLOCK1(nt4_dc) -> 31
samba3.smbtorture_s3.crypt_client(nt4_dc).LOCK1(nt4_dc) -> 19
samba3.base.dir2(nt4_dc) -> 18
samba3.base.defer_open(nt4_dc) -> 16
ERROR: test failed with exit code 1

More information about the samba-cvs mailing list