autobuild[sn-devel-144]: intermittent test failure detected

autobuild autobuild at
Wed Jun 20 16:48:20 UTC 2018

The autobuild test system (on sn-devel-144) has detected an intermittent failing test in 
the current master tree.

The autobuild log of the failure is available here:

The failure seems to be in the "samba-nt4" suite, whose build logs are available here:
The top commit at the time of the failure was:

commit defc1ced3928e074d7a229bffc168933c513553f
Author: Björn Baumbach <bb at>
Date:   Tue Jun 19 16:32:10 2018 +0200

    heimdal: remove include/includedir directives for krb5.conf
    The original heimdal code introduces a segmentation fault, due to an
    uninitialized pointer. This code does not seem to be tested very well.
    Revert "heimdal: Add include/includedir directives for krb5.conf"
    This reverts commit 0a6e9b6c0e15fa6fe46acdd357d76b8df447317f.
    Signed-off-by: Björn Baumbach <bb at>
    Reviewed-by: Alexander Bokovoy <ab at>
    Autobuild-User(master): Björn Baumbach <bbaumbach at>
    Autobuild-Date(master): Wed Jun 20 17:48:16 CEST 2018 on sn-devel-144

and the last 50 lines of the stdout log were:

[142(786)/502 at 8m23s]
[143(787)/502 at 8m23s] samba3.base.openattr(nt4_dc)
[144(788)/502 at 8m24s]
[145(789)/502 at 8m24s] samba3.base.rename(nt4_dc)
[146(790)/502 at 8m24s] samba3.base.rw1(nt4_dc)
[147(791)/502 at 8m25s] samba3.base.rw1(nt4_dc)
[148(792)/502 at 8m25s] samba3.base.rw1(nt4_dc)
[149(793)/502 at 8m26s] samba3.base.secleak(nt4_dc)
[150(794)/502 at 8m26s] samba3.base.tcon(nt4_dc)
[151(795)/502 at 8m27s] samba3.base.tcondev(nt4_dc)
[152(796)/502 at 8m27s] samba3.base.trans2(nt4_dc)
[153(797)/502 at 8m30s] samba3.base.unlink(nt4_dc)
[154(798)/502 at 8m30s] samba3.base.vuid(nt4_dc)
[155(799)/502 at 8m31s] samba3.base.xcopy(nt4_dc)
[156(800)/502 at 8m31s] samba3.base.samba3error(nt4_dc)
[157(801)/502 at 8m31s] samba3.raw.acls(nt4_dc)
[158(813)/502 at 8m33s] samba3.raw.acls nfs4acl_xattr-simple-40(nt4_dc)
[159(825)/502 at 8m36s] samba3.raw.acls nfs4acl_xattr-special-40(nt4_dc)
[160(837)/502 at 8m39s] samba3.raw.acls nfs4acl_xattr-simple-41(nt4_dc)
[161(849)/502 at 8m40s] samba3.raw.acls nfs4acl_xattr-xdr-40(nt4_dc)
[162(861)/502 at 8m43s] samba3.raw.acls nfs4acl_xattr-xdr-41(nt4_dc)
[163(873)/502 at 8m44s] samba3.raw.chkpath(nt4_dc)
[164(874)/502 at 8m44s] samba3.raw.close(nt4_dc)
[165(875)/502 at 8m45s] samba3.raw.composite(nt4_dc)
[166(879)/502 at 8m46s] samba3.raw.eas(nt4_dc)
[167(880)/502 at 8m46s] samba3.raw.lock(nt4_dc)
[168(893)/502 at 9m19s] samba3.raw.mkdir(nt4_dc)
[169(894)/502 at 9m20s] samba3.raw.mux(nt4_dc)
[170(895)/502 at 9m22s] samba3.raw.notify(nt4_dc)
Testing mkdir
UNEXPECTED(failure): samba3.raw.notify.mask(nt4_dc)
REASON: Exception: Exception: ../source4/torture/raw/notify.c:807: notify.nttrans.out.changes[0].action was 2 (0x2), expected 1 (0x1): nchanges=1 action=2 expectedAction=1 filter=0x00000004

FAILED (1 failures, 0 errors and 0 unexpected successes in 0 testsuites)

A summary with detailed information can be found in:
TOP 10 slowest tests -> 53 -> 40
samba3.raw.lock(nt4_dc) -> 33
samba3.smbtorture_s3.crypt_client(nt4_dc).OPLOCK1(nt4_dc) -> 31
samba3.base.lock(nt4_dc) -> 28
samba3.smbtorture_s3.crypt_client(nt4_dc).LOCK1(nt4_dc) -> 21
samba3.base.dir2(nt4_dc) -> 18
samba3.base.defer_open(nt4_dc) -> 16
samba3.blackbox.smbclient_s3.SMB3.sign (nt4_dc)(nt4_dc) -> 13
samba3.blackbox.smbclient_s3.SMB3.plain (nt4_member) member creds(nt4_member) -> 13
ERROR: test failed with exit code 1

More information about the samba-cvs mailing list