autobuild[sn-devel-144]: intermittent test failure detected

autobuild autobuild at
Mon Jun 4 16:26:08 UTC 2018

The autobuild test system (on sn-devel-144) has detected an intermittent failing test in 
the current master tree.

The autobuild log of the failure is available here:

The failure seems to be in the "samba-nt4" suite, whose build logs are available here:
The top commit at the time of the failure was:

commit 20644011ab095a987cdeeaba953992f308175e58
Author: Martin Schwenke <martin at>
Date:   Mon Jun 4 15:13:59 2018 +1000

    ctdb-docs: Update reference to lmaster/recmaster capability options
    Signed-off-by: Martin Schwenke <martin at>
    Reviewed-by: Amitay Isaacs <amitay at>
    Autobuild-User(master): Amitay Isaacs <amitay at>
    Autobuild-Date(master): Mon Jun  4 12:37:39 CEST 2018 on sn-devel-144

and the last 50 lines of the stdout log were:

[147(791)/502 at 6m16s] samba3.base.rw1(nt4_dc)
[148(792)/502 at 6m16s] samba3.base.rw1(nt4_dc)
[149(793)/502 at 6m17s] samba3.base.secleak(nt4_dc)
[150(794)/502 at 6m17s] samba3.base.tcon(nt4_dc)
[151(795)/502 at 6m18s] samba3.base.tcondev(nt4_dc)
[152(796)/502 at 6m18s] samba3.base.trans2(nt4_dc)
[153(797)/502 at 6m21s] samba3.base.unlink(nt4_dc)
[154(798)/502 at 6m22s] samba3.base.vuid(nt4_dc)
[155(799)/502 at 6m22s] samba3.base.xcopy(nt4_dc)
[156(800)/502 at 6m22s] samba3.base.samba3error(nt4_dc)
[157(801)/502 at 6m22s] samba3.raw.acls(nt4_dc)
[158(813)/502 at 6m24s] samba3.raw.acls nfs4acl_xattr-simple-40(nt4_dc)
[159(825)/502 at 6m27s] samba3.raw.acls nfs4acl_xattr-special-40(nt4_dc)
[160(837)/502 at 6m30s] samba3.raw.acls nfs4acl_xattr-simple-41(nt4_dc)
[161(849)/502 at 6m31s] samba3.raw.acls nfs4acl_xattr-xdr-40(nt4_dc)
[162(861)/502 at 6m33s] samba3.raw.acls nfs4acl_xattr-xdr-41(nt4_dc)
[163(873)/502 at 6m34s] samba3.raw.chkpath(nt4_dc)
[164(874)/502 at 6m35s] samba3.raw.close(nt4_dc)
[165(875)/502 at 6m35s] samba3.raw.composite(nt4_dc)
[166(879)/502 at 6m37s] samba3.raw.eas(nt4_dc)
[167(880)/502 at 6m37s] samba3.raw.lock(nt4_dc)
[168(893)/502 at 7m10s] samba3.raw.mkdir(nt4_dc)
[169(894)/502 at 7m10s] samba3.raw.mux(nt4_dc)
[170(895)/502 at 7m13s] samba3.raw.notify(nt4_dc)
Testing notify cancel
Testing notify mkdir
Testing notify rmdir
Testing notify mkdir - rmdir - mkdir - rmdir
Testing buffered notify on create of 10 files
Testing notify on unlink for the first file
UNEXPECTED(failure): samba3.raw.notify.dir(nt4_dc)
REASON: Exception: Exception: ../source4/torture/raw/notify.c:218: notify.nttrans.out.num_changes was 9 (0x9), expected 10 (0xA): wrong number of changes

FAILED (1 failures, 0 errors and 0 unexpected successes in 0 testsuites)

A summary with detailed information can be found in:
TOP 10 slowest tests -> 41
samba3.raw.lock(nt4_dc) -> 33
samba3.smbtorture_s3.crypt_client(nt4_dc).OPLOCK1(nt4_dc) -> 31 -> 28
samba3.smbtorture_s3.crypt_client(nt4_dc).LOCK1(nt4_dc) -> 18
samba3.base.dir2(nt4_dc) -> 17
samba3.base.defer_open(nt4_dc) -> 17
samba3.base.lock(nt4_dc) -> 14
samba3.smbtorture_s3.crypt_client(nt4_dc).OPLOCK2(nt4_dc) -> 10
samba3.smbtorture_s3.crypt_client(nt4_dc).IOCTL(nt4_dc) -> 9
ERROR: test failed with exit code 1

More information about the samba-cvs mailing list