autobuild[sn-devel-144]: intermittent test failure detected

autobuild autobuild at samba.org
Wed Jul 25 05:52:51 UTC 2018


The autobuild test system (on sn-devel-144) has detected an intermittent failing test in 
the current master tree.

The autobuild log of the failure is available here:

   https://git.samba.org/autobuild.flakey.sn-devel-144/2018-07-25-0752/flakey.log

The failure seems to be in the "samba" suite, whose build logs are available here:

   https://git.samba.org/autobuild.flakey.sn-devel-144/2018-07-25-0752/samba.stderr
   https://git.samba.org/autobuild.flakey.sn-devel-144/2018-07-25-0752/samba.stdout
  
The top commit at the time of the failure was:

commit 1e78cb57f663fa3592655d9b8dfa25ae9a81ff7d
Author: Ralph Boehme <slow at samba.org>
Date:   Tue Mar 13 16:17:27 2018 +0100

    s3: vfs: bump to version 40, Samba 4.10 will ship with that
    
    Signed-off-by: Ralph Boehme <slow at samba.org>
    Reviewed-by: Stefan Metzmacher <metze at samba.org>
    
    Autobuild-User(master): Stefan Metzmacher <metze at samba.org>
    Autobuild-Date(master): Wed Jul 25 03:23:44 CEST 2018 on sn-devel-144

and the last 50 lines of the stdout log were:

[811(5056)/889 at 1h20m45s] samba4.blackbox.smbclient(rodc:local)(rodc:local)
[812(5058)/889 at 1h20m46s] samba4.rpc.echo(restoredc)
[813(5068)/889 at 1h20m50s] samba4.rpc.echo(restoredc:local)
[814(5078)/889 at 1h20m53s] samba4.rpc.echo.testallowed(restoredc:local)
[815(5088)/889 at 1h20m57s] samba4.rpc.echo.testdenied(restoredc:local)
[816(5098)/889 at 1h21m0s] samba4.blackbox.smbclient(restoredc:local)(restoredc:local)
[817(5100)/889 at 1h21m0s] samba4.rpc.echo(renamedc)
[818(5110)/889 at 1h21m4s] samba4.rpc.echo(renamedc:local)
[819(5120)/889 at 1h21m8s] samba4.rpc.echo.testallowed(renamedc:local)
[820(5130)/889 at 1h21m11s] samba4.rpc.echo.testdenied(renamedc:local)
[821(5140)/889 at 1h21m14s] samba4.blackbox.smbclient(renamedc:local)(renamedc:local)
[822(5142)/889 at 1h21m15s] samba4.rpc.echo(labdc)
[823(5152)/889 at 1h21m18s] samba4.rpc.echo(labdc:local)
[824(5162)/889 at 1h21m22s] samba4.rpc.echo.testallowed(labdc:local)
[825(5172)/889 at 1h21m22s] samba4.rpc.echo.testdenied(labdc:local)
[826(5182)/889 at 1h21m22s] samba4.blackbox.smbclient(labdc:local)(labdc:local)
[827(5184)/889 at 1h21m23s] samba.tests.samba_tool.rodc(rodc:local)
[828(5193)/889 at 1h21m52s] samba.blackbox.rpcclient_samlogon(rodc:local)
[829(5197)/889 at 1h21m52s] samba.blackbox.rpcclient_samlogon_testallowed(rodc:local)
[830(5201)/889 at 1h21m53s] samba.blackbox.rpcclient_samlogon_testdenied(rodc:local)
[831(5205)/889 at 1h21m53s] samba4.drs.ridalloc_exop.python(vampire_dc)(vampire_dc)
[832(5216)/889 at 1h27m13s] samba4.drs.samba_tool_drs.python(vampire_dc)(vampire_dc:local)
[833(5230)/889 at 1h30m27s] samba4.drs.samba_tool_drs_showrepl.python(vampire_dc)(vampire_dc:local)
[834(5234)/889 at 1h30m35s] samba4.drs.replica_sync.python(vampire_dc)(vampire_dc:local)
UNEXPECTED(error): samba4.drs.replica_sync.python(vampire_dc).replica_sync.DrsReplicaSyncTestCase.test_ReplConflictsRenamedVsNewRemoteWin(vampire_dc:local)
REASON: Exception: Exception: Traceback (most recent call last):
  File "/memdisk/autobuild/fl/b1891280/samba/source4/torture/drs/python/replica_sync.py", line 329, in test_ReplConflictsRenamedVsNewRemoteWin
    self.ou2 = self._create_ou(self.ldb_dc2, "OU=Test Remote Rename Conflict")
  File "/memdisk/autobuild/fl/b1891280/samba/source4/torture/drs/python/replica_sync.py", line 125, in _create_ou
    samdb.add_ldif(ldif)
  File "bin/python/samba/__init__.py", line 230, in add_ldif
    self.add(msg, controls)
LdbError: (68, 'LDAP error 68 LDAP_ENTRY_ALREADY_EXISTS -  <Entry OU=Test Remote Rename Conflict,OU=replica_sync2084524,DC=samba,DC=example,DC=com already exists> <>')

FAILED (0 failures, 1 errors and 0 unexpected successes in 0 testsuites)

A summary with detailed information can be found in:
  ./bin/ab/summary
TOP 10 slowest tests
samba4.ldap.rodc_rwdc.python(rodc)(rodc:local) -> 431
samba4.drs.ridalloc_exop.python(vampire_dc)(vampire_dc) -> 320
samba4.rpc.samr.passwords.lockout on ncacn_np with (ad_dc_ntvfs) -> 230
samba4.ldap.vlv.python(ad_dc_ntvfs)(ad_dc_ntvfs) -> 223
samba4.rpc.samr.passwords.pwdlastset on ncacn_np with (ad_dc_ntvfs) -> 204
samba4.drs.samba_tool_drs.python(vampire_dc)(vampire_dc:local) -> 194
samba4.ldap.password_lockout.python(ad_dc_ntvfs)(ad_dc_ntvfs) -> 166
samba3.smbtorture_s3.vfs_aio_fork(simpleserver).RW2(simpleserver) -> 141
samba4.ldap.secdesc.python(ad_dc_ntvfs)(ad_dc_ntvfs) -> 116
samba4.ldb.ldaps with options -U"$USERNAME%$PASSWORD"(ad_dc_ntvfs)(ad_dc_ntvfs) -> 110
ERROR: test failed with exit code 1



More information about the samba-cvs mailing list