autobuild[sn-devel-144]: intermittent test failure detected

autobuild autobuild at samba.org
Wed Jul 18 11:05:28 UTC 2018


The autobuild test system (on sn-devel-144) has detected an intermittent failing test in 
the current master tree.

The autobuild log of the failure is available here:

   https://git.samba.org/autobuild.flakey.sn-devel-144/2018-07-18-1305/flakey.log

The failure seems to be in the "samba-nt4" suite, whose build logs are available here:

   https://git.samba.org/autobuild.flakey.sn-devel-144/2018-07-18-1305/samba-nt4.stderr
   https://git.samba.org/autobuild.flakey.sn-devel-144/2018-07-18-1305/samba-nt4.stdout
  
The top commit at the time of the failure was:

commit 7b0c1f8f19c52e97dc987d16cc438eecf6cb830f
Author: Volker Lendecke <vl at samba.org>
Date:   Fri Jul 13 16:31:21 2018 +0200

    dsdb: Fix the 32-bit build
    
    Signed-off-by: Volker Lendecke <vl at samba.org>
    Reviewed-by: Jeremy Allison <jra at samba.org>
    
    Autobuild-User(master): Jeremy Allison <jra at samba.org>
    Autobuild-Date(master): Wed Jul 18 03:12:02 CEST 2018 on sn-devel-144

and the last 50 lines of the stdout log were:

[177(998)/503 at 9m47s] samba3.raw.search(nt4_dc)
[178(1006)/503 at 9m57s] samba3.raw.search(nt4_dc)
[179(1014)/503 at 10m39s] samba3.raw.seek(nt4_dc)
[180(1015)/503 at 10m39s] samba3.raw.sfileinfo.bug(nt4_dc)
[181(1015)/503 at 10m39s] samba3.raw.streams(nt4_dc)
[182(1028)/503 at 10m43s] samba3.raw.unlink(nt4_dc)
[183(1031)/503 at 10m43s] samba3.raw.write(nt4_dc)
[184(1035)/503 at 10m44s] samba3.raw.samba3hide(nt4_dc)
[185(1036)/503 at 10m44s] samba3.raw.samba3badpath(nt4_dc)
[186(1037)/503 at 10m44s] samba3.raw.sfileinfo.rename(nt4_dc)
[187(1038)/503 at 10m45s] samba3.raw.session plain(nt4_dc)
[188(1040)/503 at 10m45s] samba3.raw.session enc(nt4_dc)
[189(1042)/503 at 10m45s] samba3.raw.samba3caseinsensitive(nt4_dc)
[190(1043)/503 at 10m45s] samba3.raw.samba3posixtimedlock(nt4_dc)
[191(1044)/503 at 10m51s] samba3.raw.samba3rootdirfid(nt4_dc)
[192(1045)/503 at 10m51s] samba3.raw.sfileinfo.end-of-file(nt4_dc)
[193(1046)/503 at 10m51s] samba3.raw.samba3checkfsp(nt4_dc)
[194(1047)/503 at 10m52s] samba3.raw.samba3closeerr(nt4_dc)
[195(1048)/503 at 10m52s] samba3.raw.samba3oplocklogoff(nt4_dc)
[196(1049)/503 at 10m52s] samba3.raw.samba3badnameblob(nt4_dc)
[197(1050)/503 at 10m52s] samba3.smb2.getinfo(nt4_dc)
[198(1056)/503 at 10m52s] samba3.smb2.lock aio(nt4_dc)
[199(1077)/503 at 10m55s] samba3.smb2.lock(nt4_dc)
[200(1098)/503 at 10m58s] samba3.smb2.read(nt4_dc)
[201(1102)/503 at 10m58s] samba3.smb2.create(nt4_dc)
[202(1115)/503 at 10m59s] samba3.smb2.acls(nt4_dc)
[203(1123)/503 at 11m1s] samba3.smb2.notify(nt4_dc)
TESTING CHANGE NOTIFY BASEDIR EVENTS
maximum runtime exceeded for smbtorture - terminating
UNEXPECTED(error): samba3.smb2.notify.basedir (samba.subunit.RemotedTestCase)(nt4_dc)
REASON: Exception: Exception: was started but never finished!
UNEXPECTED(error): samba3.smb2.notify.basedir(nt4_dc) (samba.subunit.RemotedTestCase)
REASON: was started but never finished!

FAILED (0 failures, 2 errors and 0 unexpected successes in 0 testsuites)

A summary with detailed information can be found in:
  ./bin/ab/summary
TOP 10 slowest tests
samba3.raw.notify(nt4_dc) -> 99
samba3.blackbox.net.rpc.conf(nt4_dc) -> 43
samba3.raw.oplock(nt4_dc) -> 43
samba3.raw.search(nt4_dc) -> 42
samba3.raw.lock(nt4_dc) -> 32
samba3.smbtorture_s3.crypt_client(nt4_dc).OPLOCK1(nt4_dc) -> 31
samba3.blackbox.net.local.conf(nt4_dc:local) -> 28
samba3.base.lock(nt4_dc) -> 25
samba3.base.defer_open(nt4_dc) -> 16
samba3.base.dir2(nt4_dc) -> 14
ERROR: test failed with exit code 1



More information about the samba-cvs mailing list