autobuild: intermittent test failure detected

autobuild autobuild at
Thu Mar 19 20:39:41 MDT 2015

The autobuild test system has detected an intermittent failing test in 
the current master tree.

The autobuild log of the failure is available here:

The samba build logs are available here:
The top commit at the time of the failure was:

commit 77ba781c7ad3f71e1641962f4716165cab0ad20b
Author: Michael Adam <obnox at>
Date:   Thu Mar 19 16:59:42 2015 +0100

    selftest: mark the samba4.blackbox.dbcheck test as flapping.
    This causes frequent autobuild failures recently as follows:
    [1730(16550)/1735 at 2h7m43s] samba4.blackbox.dbcheck(ad_dc_ntvfs)
    UNEXPECTED(failure): samba4.blackbox.dbcheck(ad_dc_ntvfs).dbcheck(ad_dc_ntvfs:local)
    REASON: Exception: Exception: Checking 6799 objects
    ERROR: wrong dn[CN=DrsDelObjUser_1426756150,CN=Deleted Objects,DC=samba,DC=example,DC=com] name='DrsDelObjUser_1426756150
    DEL:77ec48cb-06cc-4157-a565-770720c30929' new_dn[CN=DrsDelObjUser_1426756150
    FAILED (1 failures, 0 errors and 0 unexpected successes in 0 testsuites)
    Has been seen flapping since quite some time:
    Possibly related to the failure of tombstone_ranimation,
    drs.delete_object, and blackbox.samba_tool_demote.
    Signed-off-by: Michael Adam <obnox at>
    Reviewed-by: Guenther Deschner <gd at>
    Autobuild-User(master): Michael Adam <obnox at>
    Autobuild-Date(master): Thu Mar 19 20:43:32 CET 2015 on sn-devel-104

More information about the samba-cvs mailing list