Problem with configureing nis-utils-1.4.1

Maya_Bera at Maya_Bera at
Fri Sep 26 21:47:34 GMT 2008

Hi, could you please tell me why I am getting this error while I am 
running  ./configure. I am unable to configure this. Please help me out. 
Here is the error.

Making all in nisping
make[3]: Entering directory `/root/nis-utils-1.4.1/src/nisping'
gcc -DHAVE_CONFIG_H -I. -I. -I../.. -DLOCALEDIR=\"/usr/share/locale\" 
-I../../intl -I.  -I../../lib/xdr    -W -Wall -Wbad-function-cast 
-Wcast-align -Wcast-qual -Winline -Wmissing-declarations 
-Wmissing-prototypes -Wnested-externs -Wshadow -Wstrict-prototypes -Wundef 
-g -O2 -c nisping.c
nisping.c: In function `niscall':
nisping.c:107: error: too few arguments to function `__nisbind_create'
nisping.c: At top level:
nisping.c:318: warning: unused parameter 'check_all'
make[3]: *** [nisping.o] Error 1
make[3]: Leaving directory `/root/nis-utils-1.4.1/src/nisping'
make[2]: *** [all-recursive] Error 1
make[2]: Leaving directory `/root/nis-utils-1.4.1/src'
make[1]: *** [all-recursive] Error 1
make[1]: Leaving directory `/root/nis-utils-1.4.1'
make: *** [all-recursive-am] Error 2

-------------- next part --------------
HTML attachment scrubbed and removed

More information about the linux-nisplus mailing list